{"text_format":"1","workbook":"xlsx","n_sheets":3,"sheets":["MAP","프로토콜","CRC16"],"not_rendered":{"charts":0,"images":2,"macros":1,"external_links":0,"defined_names":0,"comments":0,"pivot_tables":0},"unopened":[],"bounds":{"document_bytes":16777216,"sheet_cells":100000,"rows_first":2000,"rows_last":500,"rows_between":2000,"halvings":0,"cell_chars":16384,"cell_head_chars":4096},"cells_cut":0,"cells_raw":0,"read":"whole","date_system":"1900"}

{"sheet":"MAP","index":0,"n_rows":1031,"n_cols":42,"rows_kept":1031,"cut":false,"hidden":false,"merged":[[0,22,0,23],[2,22,21,41],[0,1,0,8],[0,10,0,20],[32,10,32,41],[2,1,2,2],[2,4,3,4],[2,5,3,5],[2,6,3,6],[2,7,3,7],[2,8,3,8]]}
[null,"1. ADDRESS MAP",null,null,null,null,null,null,null,null,"2. OPTICAL ORIENTATION",null,null,null,null,null,null,null,null,null,null,null,"※Note1"]
[]
[null,"Address",null,"Data Length","Type","Description","R/W","Function","INDEX\n(※Note1)",null,null,null,null,null,null,null,null,null,null,null,null,null,"MODBUS 통신에서 보통 한번에 읽을 수 있는 레지스터 수는 125개(250byte) 입니다.                  \nDTPA-485-3232 는 전체 데이터 수량(센서온도2byte + 픽셀 온도2048byte) 이 2050 byte 입니다.                 \n따라서 MODBUS 규칙상 한번에 통신이 불가능 하며 전체 데이터를 얻기 위해서는 \n125byte씩 나누어서 9번 통신을 해야합니다.                 \nINDEX 는 전체 온도 데이터를 순차적으로 읽기 위한 분할 구간을 나타냅니다.                  \n1-1 은 첫번째 통신 Block의 1번째 레지스터를 의미합니다.                 \n1-2 는 첫번째 통신 Block의 2번째 레지스터를 의미합니다.                 \n2-1 은 두번째 통신 Block의 1번째 레지스터를 의미합니다.                 \n8-125 는 8번째 통신 Block의 125번째 레지스터를 의미합니다.                 \n                 \n또한 원하는 구간별로 원하는 데이터만을 얻을 수 도 있습니다.                 \n예1) Pixel 10 에 해당하는 ADDRESS 40011 부터 5개의 온도 데이터만 얻는 것이 가능합니다.                 \n예2) Pixel 1020 의 ADDRESS 41021 한 픽셀 온도 데이터만 얻는 것이 가능합니다.                 \n                 \n ※ 주의 : 시작 주소는 (40000~41024)내에서  자유롭게 지정이 가능하며,                  \n             레지스터 수량은 1~125개 까지만 지정이 가능합니다.                 \n             규칙이 어긋나면 응답을 하지 않습니다.  자세한 내용은 Sheets\"프로토콜\" 을 참고하십시오              \n \n ※ 9번째 통신 Block은 25개의 레지스터밖에 없습니다. 레지스터 수량 설정에 유의 바랍니다."]
[null,"HEX","DEC","Short"]
[]
[]
[null,{"$f":"\"0x\"&(DEC2HEX(C7))","v":"0x9C40"},40000,1,"signed","Sensor Temperature","R","03","1-1"]
[null,"0x9C41",40001,1,"signed","Temperature of PIXEL 0","R","03","1-2"]
[null,"0x9C42",40002,1,"signed","Temperature of PIXEL 1","R","03","1-3"]
[null,"0x9C43",40003,1,"signed","Temperature of PIXEL 2","R","03","1-4"]
[null,"0x9C44",40004,1,"signed","Temperature of PIXEL 3","R","03","1-5"]
[null,"0x9C45",40005,1,"signed","Temperature of PIXEL 4","R","03","1-6"]
[null,"0x9C46",40006,1,"signed","Temperature of PIXEL 5","R","03","1-7"]
[null,"0x9C47",40007,1,"signed","Temperature of PIXEL 6","R","03","1-8"]
[null,"0x9C48",40008,1,"signed","Temperature of PIXEL 7","R","03","1-9"]
[null,"0x9C49",40009,1,"signed","Temperature of PIXEL 8","R","03","1-10"]
[null,"0x9C4A",40010,1,"signed","Temperature of PIXEL 9","R","03","1-11"]
[null,"0x9C4B",40011,1,"signed","Temperature of PIXEL 10","R","03","1-12"]
[null,"0x9C4C",40012,1,"signed","Temperature of PIXEL 11","R","03","1-13"]
[null,"0x9C4D",40013,1,"signed","Temperature of PIXEL 12","R","03","1-14"]
[null,"0x9C4E",40014,1,"signed","Temperature of PIXEL 13","R","03","1-15"]
[null,"0x9C4F",40015,1,"signed","Temperature of PIXEL 14","R","03","1-16"]
[null,"0x9C50",40016,1,"signed","Temperature of PIXEL 15","R","03","1-17"]
[null,"0x9C51",40017,1,"signed","Temperature of PIXEL 16","R","03","1-18"]
[null,"0x9C52",40018,1,"signed","Temperature of PIXEL 17","R","03","1-19"]
[null,"0x9C53",40019,1,"signed","Temperature of PIXEL 18","R","03","1-20"]
[null,"0x9C54",40020,1,"signed","Temperature of PIXEL 19","R","03","1-21"]
[null,"0x9C55",40021,1,"signed","Temperature of PIXEL 20","R","03","1-22"]
[null,"0x9C56",40022,1,"signed","Temperature of PIXEL 21","R","03","1-23"]
[null,"0x9C57",40023,1,"signed","Temperature of PIXEL 22","R","03","1-24"]
[null,"0x9C58",40024,1,"signed","Temperature of PIXEL 23","R","03","1-25"]
[null,"0x9C59",40025,1,"signed","Temperature of PIXEL 24","R","03","1-26"]
[null,"0x9C5A",40026,1,"signed","Temperature of PIXEL 25","R","03","1-27",null,"3. 32ⅹ32 Active Pixel"]
[null,"0x9C5B",40027,1,"signed","Temperature of PIXEL 26","R","03","1-28"]
[null,"0x9C5C",40028,1,"signed","Temperature of PIXEL 27","R","03","1-29",null,0,1,2,3,4,5,6,7,8,9,10,11,12,13,14,15,16,17,18,19,20,21,22,23,24,25,26,27,28,29,30,31]
[null,"0x9C5D",40029,1,"signed","Temperature of PIXEL 28","R","03","1-30",null,32,33,34,35,36,37,38,39,40,41,42,43,44,45,46,47,48,49,50,51,52,53,54,55,56,57,58,59,60,61,62,63]
[null,"0x9C5E",40030,1,"signed","Temperature of PIXEL 29","R","03","1-31",null,64,65,66,67,68,69,70,71,72,73,74,75,76,77,78,79,80,81,82,83,84,85,86,87,88,89,90,91,92,93,94,95]
[null,"0x9C5F",40031,1,"signed","Temperature of PIXEL 30","R","03","1-32",null,96,97,98,99,100,101,102,103,104,105,106,107,108,109,110,111,112,113,114,115,116,117,118,119,120,121,122,123,124,125,126,127]
[null,"0x9C60",40032,1,"signed","Temperature of PIXEL 31","R","03","1-33",null,128,129,130,131,132,133,134,135,136,137,138,139,140,141,142,143,144,145,146,147,148,149,150,151,152,153,154,155,156,157,158,159]
[null,"0x9C61",40033,1,"signed","Temperature of PIXEL 32","R","03","1-34",null,160,161,162,163,164,165,166,167,168,169,170,171,172,173,174,175,176,177,178,179,180,181,182,183,184,185,186,187,188,189,190,191]
[null,"0x9C62",40034,1,"signed","Temperature of PIXEL 33","R","03","1-35",null,192,193,194,195,196,197,198,199,200,201,202,203,204,205,206,207,208,209,210,211,212,213,214,215,216,217,218,219,220,221,222,223]
[null,"0x9C63",40035,1,"signed","Temperature of PIXEL 34","R","03","1-36",null,224,225,226,227,228,229,230,231,232,233,234,235,236,237,238,239,240,241,242,243,244,245,246,247,248,249,250,251,252,253,254,255]
[null,"0x9C64",40036,1,"signed","Temperature of PIXEL 35","R","03","1-37",null,256,257,258,259,260,261,262,263,264,265,266,267,268,269,270,271,272,273,274,275,276,277,278,279,280,281,282,283,284,285,286,287]
[null,"0x9C65",40037,1,"signed","Temperature of PIXEL 36","R","03","1-38",null,288,289,290,291,292,293,294,295,296,297,298,299,300,301,302,303,304,305,306,307,308,309,310,311,312,313,314,315,316,317,318,319]
[null,"0x9C66",40038,1,"signed","Temperature of PIXEL 37","R","03","1-39",null,320,321,322,323,324,325,326,327,328,329,330,331,332,333,334,335,336,337,338,339,340,341,342,343,344,345,346,347,348,349,350,351]
[null,"0x9C67",40039,1,"signed","Temperature of PIXEL 38","R","03","1-40",null,352,353,354,355,356,357,358,359,360,361,362,363,364,365,366,367,368,369,370,371,372,373,374,375,376,377,378,379,380,381,382,383]
[null,"0x9C68",40040,1,"signed","Temperature of PIXEL 39","R","03","1-41",null,384,385,386,387,388,389,390,391,392,393,394,395,396,397,398,399,400,401,402,403,404,405,406,407,408,409,410,411,412,413,414,415]
[null,"0x9C69",40041,1,"signed","Temperature of PIXEL 40","R","03","1-42",null,416,417,418,419,420,421,422,423,424,425,426,427,428,429,430,431,432,433,434,435,436,437,438,439,440,441,442,443,444,445,446,447]
[null,"0x9C6A",40042,1,"signed","Temperature of PIXEL 41","R","03","1-43",null,448,449,450,451,452,453,454,455,456,457,458,459,460,461,462,463,464,465,466,467,468,469,470,471,472,473,474,475,476,477,478,479]
[null,"0x9C6B",40043,1,"signed","Temperature of PIXEL 42","R","03","1-44",null,480,481,482,483,484,485,486,487,488,489,490,491,492,493,494,495,496,497,498,499,500,501,502,503,504,505,506,507,508,509,510,511]
[null,"0x9C6C",40044,1,"signed","Temperature of PIXEL 43","R","03","1-45",null,512,513,514,515,516,517,518,519,520,521,522,523,524,525,526,527,528,529,530,531,532,533,534,535,536,537,538,539,540,541,542,543]
[null,"0x9C6D",40045,1,"signed","Temperature of PIXEL 44","R","03","1-46",null,544,545,546,547,548,549,550,551,552,553,554,555,556,557,558,559,560,561,562,563,564,565,566,567,568,569,570,571,572,573,574,575]
[null,"0x9C6E",40046,1,"signed","Temperature of PIXEL 45","R","03","1-47",null,576,577,578,579,580,581,582,583,584,585,586,587,588,589,590,591,592,593,594,595,596,597,598,599,600,601,602,603,604,605,606,607]
[null,"0x9C6F",40047,1,"signed","Temperature of PIXEL 46","R","03","1-48",null,608,609,610,611,612,613,614,615,616,617,618,619,620,621,622,623,624,625,626,627,628,629,630,631,632,633,634,635,636,637,638,639]
[null,"0x9C70",40048,1,"signed","Temperature of PIXEL 47","R","03","1-49",null,640,641,642,643,644,645,646,647,648,649,650,651,652,653,654,655,656,657,658,659,660,661,662,663,664,665,666,667,668,669,670,671]
[null,"0x9C71",40049,1,"signed","Temperature of PIXEL 48","R","03","1-50",null,672,673,674,675,676,677,678,679,680,681,682,683,684,685,686,687,688,689,690,691,692,693,694,695,696,697,698,699,700,701,702,703]
[null,"0x9C72",40050,1,"signed","Temperature of PIXEL 49","R","03","1-51",null,704,705,706,707,708,709,710,711,712,713,714,715,716,717,718,719,720,721,722,723,724,725,726,727,728,729,730,731,732,733,734,735]
[null,"0x9C73",40051,1,"signed","Temperature of PIXEL 50","R","03","1-52",null,736,737,738,739,740,741,742,743,744,745,746,747,748,749,750,751,752,753,754,755,756,757,758,759,760,761,762,763,764,765,766,767]
[null,"0x9C74",40052,1,"signed","Temperature of PIXEL 51","R","03","1-53",null,768,769,770,771,772,773,774,775,776,777,778,779,780,781,782,783,784,785,786,787,788,789,790,791,792,793,794,795,796,797,798,799]
[null,"0x9C75",40053,1,"signed","Temperature of PIXEL 52","R","03","1-54",null,800,801,802,803,804,805,806,807,808,809,810,811,812,813,814,815,816,817,818,819,820,821,822,823,824,825,826,827,828,829,830,831]
[null,"0x9C76",40054,1,"signed","Temperature of PIXEL 53","R","03","1-55",null,832,833,834,835,836,837,838,839,840,841,842,843,844,845,846,847,848,849,850,851,852,853,854,855,856,857,858,859,860,861,862,863]
[null,"0x9C77",40055,1,"signed","Temperature of PIXEL 54","R","03","1-56",null,864,865,866,867,868,869,870,871,872,873,874,875,876,877,878,879,880,881,882,883,884,885,886,887,888,889,890,891,892,893,894,895]
[null,"0x9C78",40056,1,"signed","Temperature of PIXEL 55","R","03","1-57",null,896,897,898,899,900,901,902,903,904,905,906,907,908,909,910,911,912,913,914,915,916,917,918,919,920,921,922,923,924,925,926,927]
[null,"0x9C79",40057,1,"signed","Temperature of PIXEL 56","R","03","1-58",null,928,929,930,931,932,933,934,935,936,937,938,939,940,941,942,943,944,945,946,947,948,949,950,951,952,953,954,955,956,957,958,959]
[null,"0x9C7A",40058,1,"signed","Temperature of PIXEL 57","R","03","1-59",null,960,961,962,963,964,965,966,967,968,969,970,971,972,973,974,975,976,977,978,979,980,981,982,983,984,985,986,987,988,989,990,991]
[null,"0x9C7B",40059,1,"signed","Temperature of PIXEL 58","R","03","1-60",null,992,993,994,995,996,997,998,999,1000,1001,1002,1003,1004,1005,1006,1007,1008,1009,1010,1011,1012,1013,1014,1015,1016,1017,1018,1019,1020,1021,1022,1023]
[null,"0x9C7C",40060,1,"signed","Temperature of PIXEL 59","R","03","1-61"]
[null,"0x9C7D",40061,1,"signed","Temperature of PIXEL 60","R","03","1-62"]
[null,"0x9C7E",40062,1,"signed","Temperature of PIXEL 61","R","03","1-63"]
[null,{"$f":"\"0x\"&(DEC2HEX(C70))","v":"0x9C7F"},40063,1,"signed","Temperature of PIXEL 62","R","03","1-64"]
[null,"0x9C80",40064,1,"signed","Temperature of PIXEL 63","R","03","1-65"]
[null,"0x9C81",40065,1,"signed","Temperature of PIXEL 64","R","03","1-66"]
[null,"0x9C82",40066,1,"signed","Temperature of PIXEL 65","R","03","1-67"]
[null,"0x9C83",40067,1,"signed","Temperature of PIXEL 66","R","03","1-68"]
[null,"0x9C84",40068,1,"signed","Temperature of PIXEL 67","R","03","1-69"]
[null,"0x9C85",40069,1,"signed","Temperature of PIXEL 68","R","03","1-70"]
[null,"0x9C86",40070,1,"signed","Temperature of PIXEL 69","R","03","1-71"]
[null,"0x9C87",40071,1,"signed","Temperature of PIXEL 70","R","03","1-72"]
[null,"0x9C88",40072,1,"signed","Temperature of PIXEL 71","R","03","1-73"]
[null,"0x9C89",40073,1,"signed","Temperature of PIXEL 72","R","03","1-74"]
[null,"0x9C8A",40074,1,"signed","Temperature of PIXEL 73","R","03","1-75"]
[null,"0x9C8B",40075,1,"signed","Temperature of PIXEL 74","R","03","1-76"]
[null,"0x9C8C",40076,1,"signed","Temperature of PIXEL 75","R","03","1-77"]
[null,"0x9C8D",40077,1,"signed","Temperature of PIXEL 76","R","03","1-78"]
[null,"0x9C8E",40078,1,"signed","Temperature of PIXEL 77","R","03","1-79"]
[null,"0x9C8F",40079,1,"signed","Temperature of PIXEL 78","R","03","1-80"]
[null,"0x9C90",40080,1,"signed","Temperature of PIXEL 79","R","03","1-81"]
[null,"0x9C91",40081,1,"signed","Temperature of PIXEL 80","R","03","1-82"]
[null,"0x9C92",40082,1,"signed","Temperature of PIXEL 81","R","03","1-83"]
[null,"0x9C93",40083,1,"signed","Temperature of PIXEL 82","R","03","1-84"]
[null,"0x9C94",40084,1,"signed","Temperature of PIXEL 83","R","03","1-85"]
[null,"0x9C95",40085,1,"signed","Temperature of PIXEL 84","R","03","1-86"]
[null,"0x9C96",40086,1,"signed","Temperature of PIXEL 85","R","03","1-87"]
[null,"0x9C97",40087,1,"signed","Temperature of PIXEL 86","R","03","1-88"]
[null,"0x9C98",40088,1,"signed","Temperature of PIXEL 87","R","03","1-89"]
[null,"0x9C99",40089,1,"signed","Temperature of PIXEL 88","R","03","1-90"]
[null,"0x9C9A",40090,1,"signed","Temperature of PIXEL 89","R","03","1-91"]
[null,"0x9C9B",40091,1,"signed","Temperature of PIXEL 90","R","03","1-92"]
[null,"0x9C9C",40092,1,"signed","Temperature of PIXEL 91","R","03","1-93"]
[null,"0x9C9D",40093,1,"signed","Temperature of PIXEL 92","R","03","1-94"]
[null,"0x9C9E",40094,1,"signed","Temperature of PIXEL 93","R","03","1-95"]
[null,"0x9C9F",40095,1,"signed","Temperature of PIXEL 94","R","03","1-96"]
[null,"0x9CA0",40096,1,"signed","Temperature of PIXEL 95","R","03","1-97"]
[null,"0x9CA1",40097,1,"signed","Temperature of PIXEL 96","R","03","1-98"]
[null,"0x9CA2",40098,1,"signed","Temperature of PIXEL 97","R","03","1-99"]
[null,"0x9CA3",40099,1,"signed","Temperature of PIXEL 98","R","03","1-100"]
[null,"0x9CA4",40100,1,"signed","Temperature of PIXEL 99","R","03","1-101"]
[null,"0x9CA5",40101,1,"signed","Temperature of PIXEL 100","R","03","1-102"]
[null,"0x9CA6",40102,1,"signed","Temperature of PIXEL 101","R","03","1-103"]
[null,"0x9CA7",40103,1,"signed","Temperature of PIXEL 102","R","03","1-104"]
[null,"0x9CA8",40104,1,"signed","Temperature of PIXEL 103","R","03","1-105"]
[null,"0x9CA9",40105,1,"signed","Temperature of PIXEL 104","R","03","1-106"]
[null,"0x9CAA",40106,1,"signed","Temperature of PIXEL 105","R","03","1-107"]
[null,"0x9CAB",40107,1,"signed","Temperature of PIXEL 106","R","03","1-108"]
[null,"0x9CAC",40108,1,"signed","Temperature of PIXEL 107","R","03","1-109"]
[null,"0x9CAD",40109,1,"signed","Temperature of PIXEL 108","R","03","1-110"]
[null,"0x9CAE",40110,1,"signed","Temperature of PIXEL 109","R","03","1-111"]
[null,"0x9CAF",40111,1,"signed","Temperature of PIXEL 110","R","03","1-112"]
[null,"0x9CB0",40112,1,"signed","Temperature of PIXEL 111","R","03","1-113"]
[null,"0x9CB1",40113,1,"signed","Temperature of PIXEL 112","R","03","1-114"]
[null,"0x9CB2",40114,1,"signed","Temperature of PIXEL 113","R","03","1-115"]
[null,"0x9CB3",40115,1,"signed","Temperature of PIXEL 114","R","03","1-116"]
[null,"0x9CB4",40116,1,"signed","Temperature of PIXEL 115","R","03","1-117"]
[null,"0x9CB5",40117,1,"signed","Temperature of PIXEL 116","R","03","1-118"]
[null,"0x9CB6",40118,1,"signed","Temperature of PIXEL 117","R","03","1-119"]
[null,"0x9CB7",40119,1,"signed","Temperature of PIXEL 118","R","03","1-120"]
[null,"0x9CB8",40120,1,"signed","Temperature of PIXEL 119","R","03","1-121"]
[null,"0x9CB9",40121,1,"signed","Temperature of PIXEL 120","R","03","1-122"]
[null,"0x9CBA",40122,1,"signed","Temperature of PIXEL 121","R","03","1-123"]
[null,"0x9CBB",40123,1,"signed","Temperature of PIXEL 122","R","03","1-124"]
[null,"0x9CBC",40124,1,"signed","Temperature of PIXEL 123","R","03","1-125"]
[null,"0x9CBD",40125,1,"signed","Temperature of PIXEL 124","R","03","2-1"]
[null,"0x9CBE",40126,1,"signed","Temperature of PIXEL 125","R","03","2-2"]
[null,{"$f":"\"0x\"&(DEC2HEX(C134))","v":"0x9CBF"},40127,1,"signed","Temperature of PIXEL 126","R","03","2-3"]
[null,"0x9CC0",40128,1,"signed","Temperature of PIXEL 127","R","03","2-4"]
[null,"0x9CC1",40129,1,"signed","Temperature of PIXEL 128","R","03","2-5"]
[null,"0x9CC2",40130,1,"signed","Temperature of PIXEL 129","R","03","2-6"]
[null,"0x9CC3",40131,1,"signed","Temperature of PIXEL 130","R","03","2-7"]
[null,"0x9CC4",40132,1,"signed","Temperature of PIXEL 131","R","03","2-8"]
[null,"0x9CC5",40133,1,"signed","Temperature of PIXEL 132","R","03","2-9"]
[null,"0x9CC6",40134,1,"signed","Temperature of PIXEL 133","R","03","2-10"]
[null,"0x9CC7",40135,1,"signed","Temperature of PIXEL 134","R","03","2-11"]
[null,"0x9CC8",40136,1,"signed","Temperature of PIXEL 135","R","03","2-12"]
[null,"0x9CC9",40137,1,"signed","Temperature of PIXEL 136","R","03","2-13"]
[null,"0x9CCA",40138,1,"signed","Temperature of PIXEL 137","R","03","2-14"]
[null,"0x9CCB",40139,1,"signed","Temperature of PIXEL 138","R","03","2-15"]
[null,"0x9CCC",40140,1,"signed","Temperature of PIXEL 139","R","03","2-16"]
[null,"0x9CCD",40141,1,"signed","Temperature of PIXEL 140","R","03","2-17"]
[null,"0x9CCE",40142,1,"signed","Temperature of PIXEL 141","R","03","2-18"]
[null,"0x9CCF",40143,1,"signed","Temperature of PIXEL 142","R","03","2-19"]
[null,"0x9CD0",40144,1,"signed","Temperature of PIXEL 143","R","03","2-20"]
[null,"0x9CD1",40145,1,"signed","Temperature of PIXEL 144","R","03","2-21"]
[null,"0x9CD2",40146,1,"signed","Temperature of PIXEL 145","R","03","2-22"]
[null,"0x9CD3",40147,1,"signed","Temperature of PIXEL 146","R","03","2-23"]
[null,"0x9CD4",40148,1,"signed","Temperature of PIXEL 147","R","03","2-24"]
[null,"0x9CD5",40149,1,"signed","Temperature of PIXEL 148","R","03","2-25"]
[null,"0x9CD6",40150,1,"signed","Temperature of PIXEL 149","R","03","2-26"]
[null,"0x9CD7",40151,1,"signed","Temperature of PIXEL 150","R","03","2-27"]
[null,"0x9CD8",40152,1,"signed","Temperature of PIXEL 151","R","03","2-28"]
[null,"0x9CD9",40153,1,"signed","Temperature of PIXEL 152","R","03","2-29"]
[null,"0x9CDA",40154,1,"signed","Temperature of PIXEL 153","R","03","2-30"]
[null,"0x9CDB",40155,1,"signed","Temperature of PIXEL 154","R","03","2-31"]
[null,"0x9CDC",40156,1,"signed","Temperature of PIXEL 155","R","03","2-32"]
[null,"0x9CDD",40157,1,"signed","Temperature of PIXEL 156","R","03","2-33"]
[null,"0x9CDE",40158,1,"signed","Temperature of PIXEL 157","R","03","2-34"]
[null,"0x9CDF",40159,1,"signed","Temperature of PIXEL 158","R","03","2-35"]
[null,"0x9CE0",40160,1,"signed","Temperature of PIXEL 159","R","03","2-36"]
[null,"0x9CE1",40161,1,"signed","Temperature of PIXEL 160","R","03","2-37"]
[null,"0x9CE2",40162,1,"signed","Temperature of PIXEL 161","R","03","2-38"]
[null,"0x9CE3",40163,1,"signed","Temperature of PIXEL 162","R","03","2-39"]
[null,"0x9CE4",40164,1,"signed","Temperature of PIXEL 163","R","03","2-40"]
[null,"0x9CE5",40165,1,"signed","Temperature of PIXEL 164","R","03","2-41"]
[null,"0x9CE6",40166,1,"signed","Temperature of PIXEL 165","R","03","2-42"]
[null,"0x9CE7",40167,1,"signed","Temperature of PIXEL 166","R","03","2-43"]
[null,"0x9CE8",40168,1,"signed","Temperature of PIXEL 167","R","03","2-44"]
[null,"0x9CE9",40169,1,"signed","Temperature of PIXEL 168","R","03","2-45"]
[null,"0x9CEA",40170,1,"signed","Temperature of PIXEL 169","R","03","2-46"]
[null,"0x9CEB",40171,1,"signed","Temperature of PIXEL 170","R","03","2-47"]
[null,"0x9CEC",40172,1,"signed","Temperature of PIXEL 171","R","03","2-48"]
[null,"0x9CED",40173,1,"signed","Temperature of PIXEL 172","R","03","2-49"]
[null,"0x9CEE",40174,1,"signed","Temperature of PIXEL 173","R","03","2-50"]
[null,"0x9CEF",40175,1,"signed","Temperature of PIXEL 174","R","03","2-51"]
[null,"0x9CF0",40176,1,"signed","Temperature of PIXEL 175","R","03","2-52"]
[null,"0x9CF1",40177,1,"signed","Temperature of PIXEL 176","R","03","2-53"]
[null,"0x9CF2",40178,1,"signed","Temperature of PIXEL 177","R","03","2-54"]
[null,"0x9CF3",40179,1,"signed","Temperature of PIXEL 178","R","03","2-55"]
[null,"0x9CF4",40180,1,"signed","Temperature of PIXEL 179","R","03","2-56"]
[null,"0x9CF5",40181,1,"signed","Temperature of PIXEL 180","R","03","2-57"]
[null,"0x9CF6",40182,1,"signed","Temperature of PIXEL 181","R","03","2-58"]
[null,"0x9CF7",40183,1,"signed","Temperature of PIXEL 182","R","03","2-59"]
[null,"0x9CF8",40184,1,"signed","Temperature of PIXEL 183","R","03","2-60"]
[null,"0x9CF9",40185,1,"signed","Temperature of PIXEL 184","R","03","2-61"]
[null,"0x9CFA",40186,1,"signed","Temperature of PIXEL 185","R","03","2-62"]
[null,"0x9CFB",40187,1,"signed","Temperature of PIXEL 186","R","03","2-63"]
[null,"0x9CFC",40188,1,"signed","Temperature of PIXEL 187","R","03","2-64"]
[null,"0x9CFD",40189,1,"signed","Temperature of PIXEL 188","R","03","2-65"]
[null,"0x9CFE",40190,1,"signed","Temperature of PIXEL 189","R","03","2-66"]
[null,{"$f":"\"0x\"&(DEC2HEX(C198))","v":"0x9CFF"},40191,1,"signed","Temperature of PIXEL 190","R","03","2-67"]
[null,"0x9D00",40192,1,"signed","Temperature of PIXEL 191","R","03","2-68"]
[null,"0x9D01",40193,1,"signed","Temperature of PIXEL 192","R","03","2-69"]
[null,"0x9D02",40194,1,"signed","Temperature of PIXEL 193","R","03","2-70"]
[null,"0x9D03",40195,1,"signed","Temperature of PIXEL 194","R","03","2-71"]
[null,"0x9D04",40196,1,"signed","Temperature of PIXEL 195","R","03","2-72"]
[null,"0x9D05",40197,1,"signed","Temperature of PIXEL 196","R","03","2-73"]
[null,"0x9D06",40198,1,"signed","Temperature of PIXEL 197","R","03","2-74"]
[null,"0x9D07",40199,1,"signed","Temperature of PIXEL 198","R","03","2-75"]
[null,"0x9D08",40200,1,"signed","Temperature of PIXEL 199","R","03","2-76"]
[null,"0x9D09",40201,1,"signed","Temperature of PIXEL 200","R","03","2-77"]
[null,"0x9D0A",40202,1,"signed","Temperature of PIXEL 201","R","03","2-78"]
[null,"0x9D0B",40203,1,"signed","Temperature of PIXEL 202","R","03","2-79"]
[null,"0x9D0C",40204,1,"signed","Temperature of PIXEL 203","R","03","2-80"]
[null,"0x9D0D",40205,1,"signed","Temperature of PIXEL 204","R","03","2-81"]
[null,"0x9D0E",40206,1,"signed","Temperature of PIXEL 205","R","03","2-82"]
[null,"0x9D0F",40207,1,"signed","Temperature of PIXEL 206","R","03","2-83"]
[null,"0x9D10",40208,1,"signed","Temperature of PIXEL 207","R","03","2-84"]
[null,"0x9D11",40209,1,"signed","Temperature of PIXEL 208","R","03","2-85"]
[null,"0x9D12",40210,1,"signed","Temperature of PIXEL 209","R","03","2-86"]
[null,"0x9D13",40211,1,"signed","Temperature of PIXEL 210","R","03","2-87"]
[null,"0x9D14",40212,1,"signed","Temperature of PIXEL 211","R","03","2-88"]
[null,"0x9D15",40213,1,"signed","Temperature of PIXEL 212","R","03","2-89"]
[null,"0x9D16",40214,1,"signed","Temperature of PIXEL 213","R","03","2-90"]
[null,"0x9D17",40215,1,"signed","Temperature of PIXEL 214","R","03","2-91"]
[null,"0x9D18",40216,1,"signed","Temperature of PIXEL 215","R","03","2-92"]
[null,"0x9D19",40217,1,"signed","Temperature of PIXEL 216","R","03","2-93"]
[null,"0x9D1A",40218,1,"signed","Temperature of PIXEL 217","R","03","2-94"]
[null,"0x9D1B",40219,1,"signed","Temperature of PIXEL 218","R","03","2-95"]
[null,"0x9D1C",40220,1,"signed","Temperature of PIXEL 219","R","03","2-96"]
[null,"0x9D1D",40221,1,"signed","Temperature of PIXEL 220","R","03","2-97"]
[null,"0x9D1E",40222,1,"signed","Temperature of PIXEL 221","R","03","2-98"]
[null,"0x9D1F",40223,1,"signed","Temperature of PIXEL 222","R","03","2-99"]
[null,"0x9D20",40224,1,"signed","Temperature of PIXEL 223","R","03","2-100"]
[null,"0x9D21",40225,1,"signed","Temperature of PIXEL 224","R","03","2-101"]
[null,"0x9D22",40226,1,"signed","Temperature of PIXEL 225","R","03","2-102"]
[null,"0x9D23",40227,1,"signed","Temperature of PIXEL 226","R","03","2-103"]
[null,"0x9D24",40228,1,"signed","Temperature of PIXEL 227","R","03","2-104"]
[null,"0x9D25",40229,1,"signed","Temperature of PIXEL 228","R","03","2-105"]
[null,"0x9D26",40230,1,"signed","Temperature of PIXEL 229","R","03","2-106"]
[null,"0x9D27",40231,1,"signed","Temperature of PIXEL 230","R","03","2-107"]
[null,"0x9D28",40232,1,"signed","Temperature of PIXEL 231","R","03","2-108"]
[null,"0x9D29",40233,1,"signed","Temperature of PIXEL 232","R","03","2-109"]
[null,"0x9D2A",40234,1,"signed","Temperature of PIXEL 233","R","03","2-110"]
[null,"0x9D2B",40235,1,"signed","Temperature of PIXEL 234","R","03","2-111"]
[null,"0x9D2C",40236,1,"signed","Temperature of PIXEL 235","R","03","2-112"]
[null,"0x9D2D",40237,1,"signed","Temperature of PIXEL 236","R","03","2-113"]
[null,"0x9D2E",40238,1,"signed","Temperature of PIXEL 237","R","03","2-114"]
[null,"0x9D2F",40239,1,"signed","Temperature of PIXEL 238","R","03","2-115"]
[null,"0x9D30",40240,1,"signed","Temperature of PIXEL 239","R","03","2-116"]
[null,"0x9D31",40241,1,"signed","Temperature of PIXEL 240","R","03","2-117"]
[null,"0x9D32",40242,1,"signed","Temperature of PIXEL 241","R","03","2-118"]
[null,"0x9D33",40243,1,"signed","Temperature of PIXEL 242","R","03","2-119"]
[null,"0x9D34",40244,1,"signed","Temperature of PIXEL 243","R","03","2-120"]
[null,"0x9D35",40245,1,"signed","Temperature of PIXEL 244","R","03","2-121"]
[null,"0x9D36",40246,1,"signed","Temperature of PIXEL 245","R","03","2-122"]
[null,"0x9D37",40247,1,"signed","Temperature of PIXEL 246","R","03","2-123"]
[null,"0x9D38",40248,1,"signed","Temperature of PIXEL 247","R","03","2-124"]
[null,"0x9D39",40249,1,"signed","Temperature of PIXEL 248","R","03","2-125"]
[null,"0x9D3A",40250,1,"signed","Temperature of PIXEL 249","R","03","3-1"]
[null,"0x9D3B",40251,1,"signed","Temperature of PIXEL 250","R","03","3-2"]
[null,"0x9D3C",40252,1,"signed","Temperature of PIXEL 251","R","03","3-3"]
[null,"0x9D3D",40253,1,"signed","Temperature of PIXEL 252","R","03","3-4"]
[null,"0x9D3E",40254,1,"signed","Temperature of PIXEL 253","R","03","3-5"]
[null,{"$f":"\"0x\"&(DEC2HEX(C262))","v":"0x9D3F"},40255,1,"signed","Temperature of PIXEL 254","R","03","3-6"]
[null,"0x9D40",40256,1,"signed","Temperature of PIXEL 255","R","03","3-7"]
[null,"0x9D41",40257,1,"signed","Temperature of PIXEL 256","R","03","3-8"]
[null,"0x9D42",40258,1,"signed","Temperature of PIXEL 257","R","03","3-9"]
[null,"0x9D43",40259,1,"signed","Temperature of PIXEL 258","R","03","3-10"]
[null,"0x9D44",40260,1,"signed","Temperature of PIXEL 259","R","03","3-11"]
[null,"0x9D45",40261,1,"signed","Temperature of PIXEL 260","R","03","3-12"]
[null,"0x9D46",40262,1,"signed","Temperature of PIXEL 261","R","03","3-13"]
[null,"0x9D47",40263,1,"signed","Temperature of PIXEL 262","R","03","3-14"]
[null,"0x9D48",40264,1,"signed","Temperature of PIXEL 263","R","03","3-15"]
[null,"0x9D49",40265,1,"signed","Temperature of PIXEL 264","R","03","3-16"]
[null,"0x9D4A",40266,1,"signed","Temperature of PIXEL 265","R","03","3-17"]
[null,"0x9D4B",40267,1,"signed","Temperature of PIXEL 266","R","03","3-18"]
[null,"0x9D4C",40268,1,"signed","Temperature of PIXEL 267","R","03","3-19"]
[null,"0x9D4D",40269,1,"signed","Temperature of PIXEL 268","R","03","3-20"]
[null,"0x9D4E",40270,1,"signed","Temperature of PIXEL 269","R","03","3-21"]
[null,"0x9D4F",40271,1,"signed","Temperature of PIXEL 270","R","03","3-22"]
[null,"0x9D50",40272,1,"signed","Temperature of PIXEL 271","R","03","3-23"]
[null,"0x9D51",40273,1,"signed","Temperature of PIXEL 272","R","03","3-24"]
[null,"0x9D52",40274,1,"signed","Temperature of PIXEL 273","R","03","3-25"]
[null,"0x9D53",40275,1,"signed","Temperature of PIXEL 274","R","03","3-26"]
[null,"0x9D54",40276,1,"signed","Temperature of PIXEL 275","R","03","3-27"]
[null,"0x9D55",40277,1,"signed","Temperature of PIXEL 276","R","03","3-28"]
[null,"0x9D56",40278,1,"signed","Temperature of PIXEL 277","R","03","3-29"]
[null,"0x9D57",40279,1,"signed","Temperature of PIXEL 278","R","03","3-30"]
[null,"0x9D58",40280,1,"signed","Temperature of PIXEL 279","R","03","3-31"]
[null,"0x9D59",40281,1,"signed","Temperature of PIXEL 280","R","03","3-32"]
[null,"0x9D5A",40282,1,"signed","Temperature of PIXEL 281","R","03","3-33"]
[null,"0x9D5B",40283,1,"signed","Temperature of PIXEL 282","R","03","3-34"]
[null,"0x9D5C",40284,1,"signed","Temperature of PIXEL 283","R","03","3-35"]
[null,"0x9D5D",40285,1,"signed","Temperature of PIXEL 284","R","03","3-36"]
[null,"0x9D5E",40286,1,"signed","Temperature of PIXEL 285","R","03","3-37"]
[null,"0x9D5F",40287,1,"signed","Temperature of PIXEL 286","R","03","3-38"]
[null,"0x9D60",40288,1,"signed","Temperature of PIXEL 287","R","03","3-39"]
[null,"0x9D61",40289,1,"signed","Temperature of PIXEL 288","R","03","3-40"]
[null,"0x9D62",40290,1,"signed","Temperature of PIXEL 289","R","03","3-41"]
[null,"0x9D63",40291,1,"signed","Temperature of PIXEL 290","R","03","3-42"]
[null,"0x9D64",40292,1,"signed","Temperature of PIXEL 291","R","03","3-43"]
[null,"0x9D65",40293,1,"signed","Temperature of PIXEL 292","R","03","3-44"]
[null,"0x9D66",40294,1,"signed","Temperature of PIXEL 293","R","03","3-45"]
[null,"0x9D67",40295,1,"signed","Temperature of PIXEL 294","R","03","3-46"]
[null,"0x9D68",40296,1,"signed","Temperature of PIXEL 295","R","03","3-47"]
[null,"0x9D69",40297,1,"signed","Temperature of PIXEL 296","R","03","3-48"]
[null,"0x9D6A",40298,1,"signed","Temperature of PIXEL 297","R","03","3-49"]
[null,"0x9D6B",40299,1,"signed","Temperature of PIXEL 298","R","03","3-50"]
[null,"0x9D6C",40300,1,"signed","Temperature of PIXEL 299","R","03","3-51"]
[null,"0x9D6D",40301,1,"signed","Temperature of PIXEL 300","R","03","3-52"]
[null,"0x9D6E",40302,1,"signed","Temperature of PIXEL 301","R","03","3-53"]
[null,"0x9D6F",40303,1,"signed","Temperature of PIXEL 302","R","03","3-54"]
[null,"0x9D70",40304,1,"signed","Temperature of PIXEL 303","R","03","3-55"]
[null,"0x9D71",40305,1,"signed","Temperature of PIXEL 304","R","03","3-56"]
[null,"0x9D72",40306,1,"signed","Temperature of PIXEL 305","R","03","3-57"]
[null,"0x9D73",40307,1,"signed","Temperature of PIXEL 306","R","03","3-58"]
[null,"0x9D74",40308,1,"signed","Temperature of PIXEL 307","R","03","3-59"]
[null,"0x9D75",40309,1,"signed","Temperature of PIXEL 308","R","03","3-60"]
[null,"0x9D76",40310,1,"signed","Temperature of PIXEL 309","R","03","3-61"]
[null,"0x9D77",40311,1,"signed","Temperature of PIXEL 310","R","03","3-62"]
[null,"0x9D78",40312,1,"signed","Temperature of PIXEL 311","R","03","3-63"]
[null,"0x9D79",40313,1,"signed","Temperature of PIXEL 312","R","03","3-64"]
[null,"0x9D7A",40314,1,"signed","Temperature of PIXEL 313","R","03","3-65"]
[null,"0x9D7B",40315,1,"signed","Temperature of PIXEL 314","R","03","3-66"]
[null,"0x9D7C",40316,1,"signed","Temperature of PIXEL 315","R","03","3-67"]
[null,"0x9D7D",40317,1,"signed","Temperature of PIXEL 316","R","03","3-68"]
[null,"0x9D7E",40318,1,"signed","Temperature of PIXEL 317","R","03","3-69"]
[null,{"$f":"\"0x\"&(DEC2HEX(C326))","v":"0x9D7F"},40319,1,"signed","Temperature of PIXEL 318","R","03","3-70"]
[null,"0x9D80",40320,1,"signed","Temperature of PIXEL 319","R","03","3-71"]
[null,"0x9D81",40321,1,"signed","Temperature of PIXEL 320","R","03","3-72"]
[null,"0x9D82",40322,1,"signed","Temperature of PIXEL 321","R","03","3-73"]
[null,"0x9D83",40323,1,"signed","Temperature of PIXEL 322","R","03","3-74"]
[null,"0x9D84",40324,1,"signed","Temperature of PIXEL 323","R","03","3-75"]
[null,"0x9D85",40325,1,"signed","Temperature of PIXEL 324","R","03","3-76"]
[null,"0x9D86",40326,1,"signed","Temperature of PIXEL 325","R","03","3-77"]
[null,"0x9D87",40327,1,"signed","Temperature of PIXEL 326","R","03","3-78"]
[null,"0x9D88",40328,1,"signed","Temperature of PIXEL 327","R","03","3-79"]
[null,"0x9D89",40329,1,"signed","Temperature of PIXEL 328","R","03","3-80"]
[null,"0x9D8A",40330,1,"signed","Temperature of PIXEL 329","R","03","3-81"]
[null,"0x9D8B",40331,1,"signed","Temperature of PIXEL 330","R","03","3-82"]
[null,"0x9D8C",40332,1,"signed","Temperature of PIXEL 331","R","03","3-83"]
[null,"0x9D8D",40333,1,"signed","Temperature of PIXEL 332","R","03","3-84"]
[null,"0x9D8E",40334,1,"signed","Temperature of PIXEL 333","R","03","3-85"]
[null,"0x9D8F",40335,1,"signed","Temperature of PIXEL 334","R","03","3-86"]
[null,"0x9D90",40336,1,"signed","Temperature of PIXEL 335","R","03","3-87"]
[null,"0x9D91",40337,1,"signed","Temperature of PIXEL 336","R","03","3-88"]
[null,"0x9D92",40338,1,"signed","Temperature of PIXEL 337","R","03","3-89"]
[null,"0x9D93",40339,1,"signed","Temperature of PIXEL 338","R","03","3-90"]
[null,"0x9D94",40340,1,"signed","Temperature of PIXEL 339","R","03","3-91"]
[null,"0x9D95",40341,1,"signed","Temperature of PIXEL 340","R","03","3-92"]
[null,"0x9D96",40342,1,"signed","Temperature of PIXEL 341","R","03","3-93"]
[null,"0x9D97",40343,1,"signed","Temperature of PIXEL 342","R","03","3-94"]
[null,"0x9D98",40344,1,"signed","Temperature of PIXEL 343","R","03","3-95"]
[null,"0x9D99",40345,1,"signed","Temperature of PIXEL 344","R","03","3-96"]
[null,"0x9D9A",40346,1,"signed","Temperature of PIXEL 345","R","03","3-97"]
[null,"0x9D9B",40347,1,"signed","Temperature of PIXEL 346","R","03","3-98"]
[null,"0x9D9C",40348,1,"signed","Temperature of PIXEL 347","R","03","3-99"]
[null,"0x9D9D",40349,1,"signed","Temperature of PIXEL 348","R","03","3-100"]
[null,"0x9D9E",40350,1,"signed","Temperature of PIXEL 349","R","03","3-101"]
[null,"0x9D9F",40351,1,"signed","Temperature of PIXEL 350","R","03","3-102"]
[null,"0x9DA0",40352,1,"signed","Temperature of PIXEL 351","R","03","3-103"]
[null,"0x9DA1",40353,1,"signed","Temperature of PIXEL 352","R","03","3-104"]
[null,"0x9DA2",40354,1,"signed","Temperature of PIXEL 353","R","03","3-105"]
[null,"0x9DA3",40355,1,"signed","Temperature of PIXEL 354","R","03","3-106"]
[null,"0x9DA4",40356,1,"signed","Temperature of PIXEL 355","R","03","3-107"]
[null,"0x9DA5",40357,1,"signed","Temperature of PIXEL 356","R","03","3-108"]
[null,"0x9DA6",40358,1,"signed","Temperature of PIXEL 357","R","03","3-109"]
[null,"0x9DA7",40359,1,"signed","Temperature of PIXEL 358","R","03","3-110"]
[null,"0x9DA8",40360,1,"signed","Temperature of PIXEL 359","R","03","3-111"]
[null,"0x9DA9",40361,1,"signed","Temperature of PIXEL 360","R","03","3-112"]
[null,"0x9DAA",40362,1,"signed","Temperature of PIXEL 361","R","03","3-113"]
[null,"0x9DAB",40363,1,"signed","Temperature of PIXEL 362","R","03","3-114"]
[null,"0x9DAC",40364,1,"signed","Temperature of PIXEL 363","R","03","3-115"]
[null,"0x9DAD",40365,1,"signed","Temperature of PIXEL 364","R","03","3-116"]
[null,"0x9DAE",40366,1,"signed","Temperature of PIXEL 365","R","03","3-117"]
[null,"0x9DAF",40367,1,"signed","Temperature of PIXEL 366","R","03","3-118"]
[null,"0x9DB0",40368,1,"signed","Temperature of PIXEL 367","R","03","3-119"]
[null,"0x9DB1",40369,1,"signed","Temperature of PIXEL 368","R","03","3-120"]
[null,"0x9DB2",40370,1,"signed","Temperature of PIXEL 369","R","03","3-121"]
[null,"0x9DB3",40371,1,"signed","Temperature of PIXEL 370","R","03","3-122"]
[null,"0x9DB4",40372,1,"signed","Temperature of PIXEL 371","R","03","3-123"]
[null,"0x9DB5",40373,1,"signed","Temperature of PIXEL 372","R","03","3-124"]
[null,"0x9DB6",40374,1,"signed","Temperature of PIXEL 373","R","03","3-125"]
[null,"0x9DB7",40375,1,"signed","Temperature of PIXEL 374","R","03","4-1"]
[null,"0x9DB8",40376,1,"signed","Temperature of PIXEL 375","R","03","4-2"]
[null,"0x9DB9",40377,1,"signed","Temperature of PIXEL 376","R","03","4-3"]
[null,"0x9DBA",40378,1,"signed","Temperature of PIXEL 377","R","03","4-4"]
[null,"0x9DBB",40379,1,"signed","Temperature of PIXEL 378","R","03","4-5"]
[null,"0x9DBC",40380,1,"signed","Temperature of PIXEL 379","R","03","4-6"]
[null,"0x9DBD",40381,1,"signed","Temperature of PIXEL 380","R","03","4-7"]
[null,"0x9DBE",40382,1,"signed","Temperature of PIXEL 381","R","03","4-8"]
[null,{"$f":"\"0x\"&(DEC2HEX(C390))","v":"0x9DBF"},40383,1,"signed","Temperature of PIXEL 382","R","03","4-9"]
[null,"0x9DC0",40384,1,"signed","Temperature of PIXEL 383","R","03","4-10"]
[null,"0x9DC1",40385,1,"signed","Temperature of PIXEL 384","R","03","4-11"]
[null,"0x9DC2",40386,1,"signed","Temperature of PIXEL 385","R","03","4-12"]
[null,"0x9DC3",40387,1,"signed","Temperature of PIXEL 386","R","03","4-13"]
[null,"0x9DC4",40388,1,"signed","Temperature of PIXEL 387","R","03","4-14"]
[null,"0x9DC5",40389,1,"signed","Temperature of PIXEL 388","R","03","4-15"]
[null,"0x9DC6",40390,1,"signed","Temperature of PIXEL 389","R","03","4-16"]
[null,"0x9DC7",40391,1,"signed","Temperature of PIXEL 390","R","03","4-17"]
[null,"0x9DC8",40392,1,"signed","Temperature of PIXEL 391","R","03","4-18"]
[null,"0x9DC9",40393,1,"signed","Temperature of PIXEL 392","R","03","4-19"]
[null,"0x9DCA",40394,1,"signed","Temperature of PIXEL 393","R","03","4-20"]
[null,"0x9DCB",40395,1,"signed","Temperature of PIXEL 394","R","03","4-21"]
[null,"0x9DCC",40396,1,"signed","Temperature of PIXEL 395","R","03","4-22"]
[null,"0x9DCD",40397,1,"signed","Temperature of PIXEL 396","R","03","4-23"]
[null,"0x9DCE",40398,1,"signed","Temperature of PIXEL 397","R","03","4-24"]
[null,"0x9DCF",40399,1,"signed","Temperature of PIXEL 398","R","03","4-25"]
[null,"0x9DD0",40400,1,"signed","Temperature of PIXEL 399","R","03","4-26"]
[null,"0x9DD1",40401,1,"signed","Temperature of PIXEL 400","R","03","4-27"]
[null,"0x9DD2",40402,1,"signed","Temperature of PIXEL 401","R","03","4-28"]
[null,"0x9DD3",40403,1,"signed","Temperature of PIXEL 402","R","03","4-29"]
[null,"0x9DD4",40404,1,"signed","Temperature of PIXEL 403","R","03","4-30"]
[null,"0x9DD5",40405,1,"signed","Temperature of PIXEL 404","R","03","4-31"]
[null,"0x9DD6",40406,1,"signed","Temperature of PIXEL 405","R","03","4-32"]
[null,"0x9DD7",40407,1,"signed","Temperature of PIXEL 406","R","03","4-33"]
[null,"0x9DD8",40408,1,"signed","Temperature of PIXEL 407","R","03","4-34"]
[null,"0x9DD9",40409,1,"signed","Temperature of PIXEL 408","R","03","4-35"]
[null,"0x9DDA",40410,1,"signed","Temperature of PIXEL 409","R","03","4-36"]
[null,"0x9DDB",40411,1,"signed","Temperature of PIXEL 410","R","03","4-37"]
[null,"0x9DDC",40412,1,"signed","Temperature of PIXEL 411","R","03","4-38"]
[null,"0x9DDD",40413,1,"signed","Temperature of PIXEL 412","R","03","4-39"]
[null,"0x9DDE",40414,1,"signed","Temperature of PIXEL 413","R","03","4-40"]
[null,"0x9DDF",40415,1,"signed","Temperature of PIXEL 414","R","03","4-41"]
[null,"0x9DE0",40416,1,"signed","Temperature of PIXEL 415","R","03","4-42"]
[null,"0x9DE1",40417,1,"signed","Temperature of PIXEL 416","R","03","4-43"]
[null,"0x9DE2",40418,1,"signed","Temperature of PIXEL 417","R","03","4-44"]
[null,"0x9DE3",40419,1,"signed","Temperature of PIXEL 418","R","03","4-45"]
[null,"0x9DE4",40420,1,"signed","Temperature of PIXEL 419","R","03","4-46"]
[null,"0x9DE5",40421,1,"signed","Temperature of PIXEL 420","R","03","4-47"]
[null,"0x9DE6",40422,1,"signed","Temperature of PIXEL 421","R","03","4-48"]
[null,"0x9DE7",40423,1,"signed","Temperature of PIXEL 422","R","03","4-49"]
[null,"0x9DE8",40424,1,"signed","Temperature of PIXEL 423","R","03","4-50"]
[null,"0x9DE9",40425,1,"signed","Temperature of PIXEL 424","R","03","4-51"]
[null,"0x9DEA",40426,1,"signed","Temperature of PIXEL 425","R","03","4-52"]
[null,"0x9DEB",40427,1,"signed","Temperature of PIXEL 426","R","03","4-53"]
[null,"0x9DEC",40428,1,"signed","Temperature of PIXEL 427","R","03","4-54"]
[null,"0x9DED",40429,1,"signed","Temperature of PIXEL 428","R","03","4-55"]
[null,"0x9DEE",40430,1,"signed","Temperature of PIXEL 429","R","03","4-56"]
[null,"0x9DEF",40431,1,"signed","Temperature of PIXEL 430","R","03","4-57"]
[null,"0x9DF0",40432,1,"signed","Temperature of PIXEL 431","R","03","4-58"]
[null,"0x9DF1",40433,1,"signed","Temperature of PIXEL 432","R","03","4-59"]
[null,"0x9DF2",40434,1,"signed","Temperature of PIXEL 433","R","03","4-60"]
[null,"0x9DF3",40435,1,"signed","Temperature of PIXEL 434","R","03","4-61"]
[null,"0x9DF4",40436,1,"signed","Temperature of PIXEL 435","R","03","4-62"]
[null,"0x9DF5",40437,1,"signed","Temperature of PIXEL 436","R","03","4-63"]
[null,"0x9DF6",40438,1,"signed","Temperature of PIXEL 437","R","03","4-64"]
[null,"0x9DF7",40439,1,"signed","Temperature of PIXEL 438","R","03","4-65"]
[null,"0x9DF8",40440,1,"signed","Temperature of PIXEL 439","R","03","4-66"]
[null,"0x9DF9",40441,1,"signed","Temperature of PIXEL 440","R","03","4-67"]
[null,"0x9DFA",40442,1,"signed","Temperature of PIXEL 441","R","03","4-68"]
[null,"0x9DFB",40443,1,"signed","Temperature of PIXEL 442","R","03","4-69"]
[null,"0x9DFC",40444,1,"signed","Temperature of PIXEL 443","R","03","4-70"]
[null,"0x9DFD",40445,1,"signed","Temperature of PIXEL 444","R","03","4-71"]
[null,"0x9DFE",40446,1,"signed","Temperature of PIXEL 445","R","03","4-72"]
[null,{"$f":"\"0x\"&(DEC2HEX(C454))","v":"0x9DFF"},40447,1,"signed","Temperature of PIXEL 446","R","03","4-73"]
[null,"0x9E00",40448,1,"signed","Temperature of PIXEL 447","R","03","4-74"]
[null,"0x9E01",40449,1,"signed","Temperature of PIXEL 448","R","03","4-75"]
[null,"0x9E02",40450,1,"signed","Temperature of PIXEL 449","R","03","4-76"]
[null,"0x9E03",40451,1,"signed","Temperature of PIXEL 450","R","03","4-77"]
[null,"0x9E04",40452,1,"signed","Temperature of PIXEL 451","R","03","4-78"]
[null,"0x9E05",40453,1,"signed","Temperature of PIXEL 452","R","03","4-79"]
[null,"0x9E06",40454,1,"signed","Temperature of PIXEL 453","R","03","4-80"]
[null,"0x9E07",40455,1,"signed","Temperature of PIXEL 454","R","03","4-81"]
[null,"0x9E08",40456,1,"signed","Temperature of PIXEL 455","R","03","4-82"]
[null,"0x9E09",40457,1,"signed","Temperature of PIXEL 456","R","03","4-83"]
[null,"0x9E0A",40458,1,"signed","Temperature of PIXEL 457","R","03","4-84"]
[null,"0x9E0B",40459,1,"signed","Temperature of PIXEL 458","R","03","4-85"]
[null,"0x9E0C",40460,1,"signed","Temperature of PIXEL 459","R","03","4-86"]
[null,"0x9E0D",40461,1,"signed","Temperature of PIXEL 460","R","03","4-87"]
[null,"0x9E0E",40462,1,"signed","Temperature of PIXEL 461","R","03","4-88"]
[null,"0x9E0F",40463,1,"signed","Temperature of PIXEL 462","R","03","4-89"]
[null,"0x9E10",40464,1,"signed","Temperature of PIXEL 463","R","03","4-90"]
[null,"0x9E11",40465,1,"signed","Temperature of PIXEL 464","R","03","4-91"]
[null,"0x9E12",40466,1,"signed","Temperature of PIXEL 465","R","03","4-92"]
[null,"0x9E13",40467,1,"signed","Temperature of PIXEL 466","R","03","4-93"]
[null,"0x9E14",40468,1,"signed","Temperature of PIXEL 467","R","03","4-94"]
[null,"0x9E15",40469,1,"signed","Temperature of PIXEL 468","R","03","4-95"]
[null,"0x9E16",40470,1,"signed","Temperature of PIXEL 469","R","03","4-96"]
[null,"0x9E17",40471,1,"signed","Temperature of PIXEL 470","R","03","4-97"]
[null,"0x9E18",40472,1,"signed","Temperature of PIXEL 471","R","03","4-98"]
[null,"0x9E19",40473,1,"signed","Temperature of PIXEL 472","R","03","4-99"]
[null,"0x9E1A",40474,1,"signed","Temperature of PIXEL 473","R","03","4-100"]
[null,"0x9E1B",40475,1,"signed","Temperature of PIXEL 474","R","03","4-101"]
[null,"0x9E1C",40476,1,"signed","Temperature of PIXEL 475","R","03","4-102"]
[null,"0x9E1D",40477,1,"signed","Temperature of PIXEL 476","R","03","4-103"]
[null,"0x9E1E",40478,1,"signed","Temperature of PIXEL 477","R","03","4-104"]
[null,"0x9E1F",40479,1,"signed","Temperature of PIXEL 478","R","03","4-105"]
[null,"0x9E20",40480,1,"signed","Temperature of PIXEL 479","R","03","4-106"]
[null,"0x9E21",40481,1,"signed","Temperature of PIXEL 480","R","03","4-107"]
[null,"0x9E22",40482,1,"signed","Temperature of PIXEL 481","R","03","4-108"]
[null,"0x9E23",40483,1,"signed","Temperature of PIXEL 482","R","03","4-109"]
[null,"0x9E24",40484,1,"signed","Temperature of PIXEL 483","R","03","4-110"]
[null,"0x9E25",40485,1,"signed","Temperature of PIXEL 484","R","03","4-111"]
[null,"0x9E26",40486,1,"signed","Temperature of PIXEL 485","R","03","4-112"]
[null,"0x9E27",40487,1,"signed","Temperature of PIXEL 486","R","03","4-113"]
[null,"0x9E28",40488,1,"signed","Temperature of PIXEL 487","R","03","4-114"]
[null,"0x9E29",40489,1,"signed","Temperature of PIXEL 488","R","03","4-115"]
[null,"0x9E2A",40490,1,"signed","Temperature of PIXEL 489","R","03","4-116"]
[null,"0x9E2B",40491,1,"signed","Temperature of PIXEL 490","R","03","4-117"]
[null,"0x9E2C",40492,1,"signed","Temperature of PIXEL 491","R","03","4-118"]
[null,"0x9E2D",40493,1,"signed","Temperature of PIXEL 492","R","03","4-119"]
[null,"0x9E2E",40494,1,"signed","Temperature of PIXEL 493","R","03","4-120"]
[null,"0x9E2F",40495,1,"signed","Temperature of PIXEL 494","R","03","4-121"]
[null,"0x9E30",40496,1,"signed","Temperature of PIXEL 495","R","03","4-122"]
[null,"0x9E31",40497,1,"signed","Temperature of PIXEL 496","R","03","4-123"]
[null,"0x9E32",40498,1,"signed","Temperature of PIXEL 497","R","03","4-124"]
[null,"0x9E33",40499,1,"signed","Temperature of PIXEL 498","R","03","4-125"]
[null,"0x9E34",40500,1,"signed","Temperature of PIXEL 499","R","03","5-1"]
[null,"0x9E35",40501,1,"signed","Temperature of PIXEL 500","R","03","5-2"]
[null,"0x9E36",40502,1,"signed","Temperature of PIXEL 501","R","03","5-3"]
[null,"0x9E37",40503,1,"signed","Temperature of PIXEL 502","R","03","5-4"]
[null,"0x9E38",40504,1,"signed","Temperature of PIXEL 503","R","03","5-5"]
[null,"0x9E39",40505,1,"signed","Temperature of PIXEL 504","R","03","5-6"]
[null,"0x9E3A",40506,1,"signed","Temperature of PIXEL 505","R","03","5-7"]
[null,"0x9E3B",40507,1,"signed","Temperature of PIXEL 506","R","03","5-8"]
[null,"0x9E3C",40508,1,"signed","Temperature of PIXEL 507","R","03","5-9"]
[null,"0x9E3D",40509,1,"signed","Temperature of PIXEL 508","R","03","5-10"]
[null,"0x9E3E",40510,1,"signed","Temperature of PIXEL 509","R","03","5-11"]
[null,{"$f":"\"0x\"&(DEC2HEX(C518))","v":"0x9E3F"},40511,1,"signed","Temperature of PIXEL 510","R","03","5-12"]
[null,"0x9E40",40512,1,"signed","Temperature of PIXEL 511","R","03","5-13"]
[null,"0x9E41",40513,1,"signed","Temperature of PIXEL 512","R","03","5-14"]
[null,"0x9E42",40514,1,"signed","Temperature of PIXEL 513","R","03","5-15"]
[null,"0x9E43",40515,1,"signed","Temperature of PIXEL 514","R","03","5-16"]
[null,"0x9E44",40516,1,"signed","Temperature of PIXEL 515","R","03","5-17"]
[null,"0x9E45",40517,1,"signed","Temperature of PIXEL 516","R","03","5-18"]
[null,"0x9E46",40518,1,"signed","Temperature of PIXEL 517","R","03","5-19"]
[null,"0x9E47",40519,1,"signed","Temperature of PIXEL 518","R","03","5-20"]
[null,"0x9E48",40520,1,"signed","Temperature of PIXEL 519","R","03","5-21"]
[null,"0x9E49",40521,1,"signed","Temperature of PIXEL 520","R","03","5-22"]
[null,"0x9E4A",40522,1,"signed","Temperature of PIXEL 521","R","03","5-23"]
[null,"0x9E4B",40523,1,"signed","Temperature of PIXEL 522","R","03","5-24"]
[null,"0x9E4C",40524,1,"signed","Temperature of PIXEL 523","R","03","5-25"]
[null,"0x9E4D",40525,1,"signed","Temperature of PIXEL 524","R","03","5-26"]
[null,"0x9E4E",40526,1,"signed","Temperature of PIXEL 525","R","03","5-27"]
[null,"0x9E4F",40527,1,"signed","Temperature of PIXEL 526","R","03","5-28"]
[null,"0x9E50",40528,1,"signed","Temperature of PIXEL 527","R","03","5-29"]
[null,"0x9E51",40529,1,"signed","Temperature of PIXEL 528","R","03","5-30"]
[null,"0x9E52",40530,1,"signed","Temperature of PIXEL 529","R","03","5-31"]
[null,"0x9E53",40531,1,"signed","Temperature of PIXEL 530","R","03","5-32"]
[null,"0x9E54",40532,1,"signed","Temperature of PIXEL 531","R","03","5-33"]
[null,"0x9E55",40533,1,"signed","Temperature of PIXEL 532","R","03","5-34"]
[null,"0x9E56",40534,1,"signed","Temperature of PIXEL 533","R","03","5-35"]
[null,"0x9E57",40535,1,"signed","Temperature of PIXEL 534","R","03","5-36"]
[null,"0x9E58",40536,1,"signed","Temperature of PIXEL 535","R","03","5-37"]
[null,"0x9E59",40537,1,"signed","Temperature of PIXEL 536","R","03","5-38"]
[null,"0x9E5A",40538,1,"signed","Temperature of PIXEL 537","R","03","5-39"]
[null,"0x9E5B",40539,1,"signed","Temperature of PIXEL 538","R","03","5-40"]
[null,"0x9E5C",40540,1,"signed","Temperature of PIXEL 539","R","03","5-41"]
[null,"0x9E5D",40541,1,"signed","Temperature of PIXEL 540","R","03","5-42"]
[null,"0x9E5E",40542,1,"signed","Temperature of PIXEL 541","R","03","5-43"]
[null,"0x9E5F",40543,1,"signed","Temperature of PIXEL 542","R","03","5-44"]
[null,"0x9E60",40544,1,"signed","Temperature of PIXEL 543","R","03","5-45"]
[null,"0x9E61",40545,1,"signed","Temperature of PIXEL 544","R","03","5-46"]
[null,"0x9E62",40546,1,"signed","Temperature of PIXEL 545","R","03","5-47"]
[null,"0x9E63",40547,1,"signed","Temperature of PIXEL 546","R","03","5-48"]
[null,"0x9E64",40548,1,"signed","Temperature of PIXEL 547","R","03","5-49"]
[null,"0x9E65",40549,1,"signed","Temperature of PIXEL 548","R","03","5-50"]
[null,"0x9E66",40550,1,"signed","Temperature of PIXEL 549","R","03","5-51"]
[null,"0x9E67",40551,1,"signed","Temperature of PIXEL 550","R","03","5-52"]
[null,"0x9E68",40552,1,"signed","Temperature of PIXEL 551","R","03","5-53"]
[null,"0x9E69",40553,1,"signed","Temperature of PIXEL 552","R","03","5-54"]
[null,"0x9E6A",40554,1,"signed","Temperature of PIXEL 553","R","03","5-55"]
[null,"0x9E6B",40555,1,"signed","Temperature of PIXEL 554","R","03","5-56"]
[null,"0x9E6C",40556,1,"signed","Temperature of PIXEL 555","R","03","5-57"]
[null,"0x9E6D",40557,1,"signed","Temperature of PIXEL 556","R","03","5-58"]
[null,"0x9E6E",40558,1,"signed","Temperature of PIXEL 557","R","03","5-59"]
[null,"0x9E6F",40559,1,"signed","Temperature of PIXEL 558","R","03","5-60"]
[null,"0x9E70",40560,1,"signed","Temperature of PIXEL 559","R","03","5-61"]
[null,"0x9E71",40561,1,"signed","Temperature of PIXEL 560","R","03","5-62"]
[null,"0x9E72",40562,1,"signed","Temperature of PIXEL 561","R","03","5-63"]
[null,"0x9E73",40563,1,"signed","Temperature of PIXEL 562","R","03","5-64"]
[null,"0x9E74",40564,1,"signed","Temperature of PIXEL 563","R","03","5-65"]
[null,"0x9E75",40565,1,"signed","Temperature of PIXEL 564","R","03","5-66"]
[null,"0x9E76",40566,1,"signed","Temperature of PIXEL 565","R","03","5-67"]
[null,"0x9E77",40567,1,"signed","Temperature of PIXEL 566","R","03","5-68"]
[null,"0x9E78",40568,1,"signed","Temperature of PIXEL 567","R","03","5-69"]
[null,"0x9E79",40569,1,"signed","Temperature of PIXEL 568","R","03","5-70"]
[null,"0x9E7A",40570,1,"signed","Temperature of PIXEL 569","R","03","5-71"]
[null,"0x9E7B",40571,1,"signed","Temperature of PIXEL 570","R","03","5-72"]
[null,"0x9E7C",40572,1,"signed","Temperature of PIXEL 571","R","03","5-73"]
[null,"0x9E7D",40573,1,"signed","Temperature of PIXEL 572","R","03","5-74"]
[null,"0x9E7E",40574,1,"signed","Temperature of PIXEL 573","R","03","5-75"]
[null,{"$f":"\"0x\"&(DEC2HEX(C582))","v":"0x9E7F"},40575,1,"signed","Temperature of PIXEL 574","R","03","5-76"]
[null,"0x9E80",40576,1,"signed","Temperature of PIXEL 575","R","03","5-77"]
[null,"0x9E81",40577,1,"signed","Temperature of PIXEL 576","R","03","5-78"]
[null,"0x9E82",40578,1,"signed","Temperature of PIXEL 577","R","03","5-79"]
[null,"0x9E83",40579,1,"signed","Temperature of PIXEL 578","R","03","5-80"]
[null,"0x9E84",40580,1,"signed","Temperature of PIXEL 579","R","03","5-81"]
[null,"0x9E85",40581,1,"signed","Temperature of PIXEL 580","R","03","5-82"]
[null,"0x9E86",40582,1,"signed","Temperature of PIXEL 581","R","03","5-83"]
[null,"0x9E87",40583,1,"signed","Temperature of PIXEL 582","R","03","5-84"]
[null,"0x9E88",40584,1,"signed","Temperature of PIXEL 583","R","03","5-85"]
[null,"0x9E89",40585,1,"signed","Temperature of PIXEL 584","R","03","5-86"]
[null,"0x9E8A",40586,1,"signed","Temperature of PIXEL 585","R","03","5-87"]
[null,"0x9E8B",40587,1,"signed","Temperature of PIXEL 586","R","03","5-88"]
[null,"0x9E8C",40588,1,"signed","Temperature of PIXEL 587","R","03","5-89"]
[null,"0x9E8D",40589,1,"signed","Temperature of PIXEL 588","R","03","5-90"]
[null,"0x9E8E",40590,1,"signed","Temperature of PIXEL 589","R","03","5-91"]
[null,"0x9E8F",40591,1,"signed","Temperature of PIXEL 590","R","03","5-92"]
[null,"0x9E90",40592,1,"signed","Temperature of PIXEL 591","R","03","5-93"]
[null,"0x9E91",40593,1,"signed","Temperature of PIXEL 592","R","03","5-94"]
[null,"0x9E92",40594,1,"signed","Temperature of PIXEL 593","R","03","5-95"]
[null,"0x9E93",40595,1,"signed","Temperature of PIXEL 594","R","03","5-96"]
[null,"0x9E94",40596,1,"signed","Temperature of PIXEL 595","R","03","5-97"]
[null,"0x9E95",40597,1,"signed","Temperature of PIXEL 596","R","03","5-98"]
[null,"0x9E96",40598,1,"signed","Temperature of PIXEL 597","R","03","5-99"]
[null,"0x9E97",40599,1,"signed","Temperature of PIXEL 598","R","03","5-100"]
[null,"0x9E98",40600,1,"signed","Temperature of PIXEL 599","R","03","5-101"]
[null,"0x9E99",40601,1,"signed","Temperature of PIXEL 600","R","03","5-102"]
[null,"0x9E9A",40602,1,"signed","Temperature of PIXEL 601","R","03","5-103"]
[null,"0x9E9B",40603,1,"signed","Temperature of PIXEL 602","R","03","5-104"]
[null,"0x9E9C",40604,1,"signed","Temperature of PIXEL 603","R","03","5-105"]
[null,"0x9E9D",40605,1,"signed","Temperature of PIXEL 604","R","03","5-106"]
[null,"0x9E9E",40606,1,"signed","Temperature of PIXEL 605","R","03","5-107"]
[null,"0x9E9F",40607,1,"signed","Temperature of PIXEL 606","R","03","5-108"]
[null,"0x9EA0",40608,1,"signed","Temperature of PIXEL 607","R","03","5-109"]
[null,"0x9EA1",40609,1,"signed","Temperature of PIXEL 608","R","03","5-110"]
[null,"0x9EA2",40610,1,"signed","Temperature of PIXEL 609","R","03","5-111"]
[null,"0x9EA3",40611,1,"signed","Temperature of PIXEL 610","R","03","5-112"]
[null,"0x9EA4",40612,1,"signed","Temperature of PIXEL 611","R","03","5-113"]
[null,"0x9EA5",40613,1,"signed","Temperature of PIXEL 612","R","03","5-114"]
[null,"0x9EA6",40614,1,"signed","Temperature of PIXEL 613","R","03","5-115"]
[null,"0x9EA7",40615,1,"signed","Temperature of PIXEL 614","R","03","5-116"]
[null,"0x9EA8",40616,1,"signed","Temperature of PIXEL 615","R","03","5-117"]
[null,"0x9EA9",40617,1,"signed","Temperature of PIXEL 616","R","03","5-118"]
[null,"0x9EAA",40618,1,"signed","Temperature of PIXEL 617","R","03","5-119"]
[null,"0x9EAB",40619,1,"signed","Temperature of PIXEL 618","R","03","5-120"]
[null,"0x9EAC",40620,1,"signed","Temperature of PIXEL 619","R","03","5-121"]
[null,"0x9EAD",40621,1,"signed","Temperature of PIXEL 620","R","03","5-122"]
[null,"0x9EAE",40622,1,"signed","Temperature of PIXEL 621","R","03","5-123"]
[null,"0x9EAF",40623,1,"signed","Temperature of PIXEL 622","R","03","5-124"]
[null,"0x9EB0",40624,1,"signed","Temperature of PIXEL 623","R","03","5-125"]
[null,"0x9EB1",40625,1,"signed","Temperature of PIXEL 624","R","03","6-1"]
[null,"0x9EB2",40626,1,"signed","Temperature of PIXEL 625","R","03","6-2"]
[null,"0x9EB3",40627,1,"signed","Temperature of PIXEL 626","R","03","6-3"]
[null,"0x9EB4",40628,1,"signed","Temperature of PIXEL 627","R","03","6-4"]
[null,"0x9EB5",40629,1,"signed","Temperature of PIXEL 628","R","03","6-5"]
[null,"0x9EB6",40630,1,"signed","Temperature of PIXEL 629","R","03","6-6"]
[null,"0x9EB7",40631,1,"signed","Temperature of PIXEL 630","R","03","6-7"]
[null,"0x9EB8",40632,1,"signed","Temperature of PIXEL 631","R","03","6-8"]
[null,"0x9EB9",40633,1,"signed","Temperature of PIXEL 632","R","03","6-9"]
[null,"0x9EBA",40634,1,"signed","Temperature of PIXEL 633","R","03","6-10"]
[null,"0x9EBB",40635,1,"signed","Temperature of PIXEL 634","R","03","6-11"]
[null,"0x9EBC",40636,1,"signed","Temperature of PIXEL 635","R","03","6-12"]
[null,"0x9EBD",40637,1,"signed","Temperature of PIXEL 636","R","03","6-13"]
[null,"0x9EBE",40638,1,"signed","Temperature of PIXEL 637","R","03","6-14"]
[null,{"$f":"\"0x\"&(DEC2HEX(C646))","v":"0x9EBF"},40639,1,"signed","Temperature of PIXEL 638","R","03","6-15"]
[null,"0x9EC0",40640,1,"signed","Temperature of PIXEL 639","R","03","6-16"]
[null,"0x9EC1",40641,1,"signed","Temperature of PIXEL 640","R","03","6-17"]
[null,"0x9EC2",40642,1,"signed","Temperature of PIXEL 641","R","03","6-18"]
[null,"0x9EC3",40643,1,"signed","Temperature of PIXEL 642","R","03","6-19"]
[null,"0x9EC4",40644,1,"signed","Temperature of PIXEL 643","R","03","6-20"]
[null,"0x9EC5",40645,1,"signed","Temperature of PIXEL 644","R","03","6-21"]
[null,"0x9EC6",40646,1,"signed","Temperature of PIXEL 645","R","03","6-22"]
[null,"0x9EC7",40647,1,"signed","Temperature of PIXEL 646","R","03","6-23"]
[null,"0x9EC8",40648,1,"signed","Temperature of PIXEL 647","R","03","6-24"]
[null,"0x9EC9",40649,1,"signed","Temperature of PIXEL 648","R","03","6-25"]
[null,"0x9ECA",40650,1,"signed","Temperature of PIXEL 649","R","03","6-26"]
[null,"0x9ECB",40651,1,"signed","Temperature of PIXEL 650","R","03","6-27"]
[null,"0x9ECC",40652,1,"signed","Temperature of PIXEL 651","R","03","6-28"]
[null,"0x9ECD",40653,1,"signed","Temperature of PIXEL 652","R","03","6-29"]
[null,"0x9ECE",40654,1,"signed","Temperature of PIXEL 653","R","03","6-30"]
[null,"0x9ECF",40655,1,"signed","Temperature of PIXEL 654","R","03","6-31"]
[null,"0x9ED0",40656,1,"signed","Temperature of PIXEL 655","R","03","6-32"]
[null,"0x9ED1",40657,1,"signed","Temperature of PIXEL 656","R","03","6-33"]
[null,"0x9ED2",40658,1,"signed","Temperature of PIXEL 657","R","03","6-34"]
[null,"0x9ED3",40659,1,"signed","Temperature of PIXEL 658","R","03","6-35"]
[null,"0x9ED4",40660,1,"signed","Temperature of PIXEL 659","R","03","6-36"]
[null,"0x9ED5",40661,1,"signed","Temperature of PIXEL 660","R","03","6-37"]
[null,"0x9ED6",40662,1,"signed","Temperature of PIXEL 661","R","03","6-38"]
[null,"0x9ED7",40663,1,"signed","Temperature of PIXEL 662","R","03","6-39"]
[null,"0x9ED8",40664,1,"signed","Temperature of PIXEL 663","R","03","6-40"]
[null,"0x9ED9",40665,1,"signed","Temperature of PIXEL 664","R","03","6-41"]
[null,"0x9EDA",40666,1,"signed","Temperature of PIXEL 665","R","03","6-42"]
[null,"0x9EDB",40667,1,"signed","Temperature of PIXEL 666","R","03","6-43"]
[null,"0x9EDC",40668,1,"signed","Temperature of PIXEL 667","R","03","6-44"]
[null,"0x9EDD",40669,1,"signed","Temperature of PIXEL 668","R","03","6-45"]
[null,"0x9EDE",40670,1,"signed","Temperature of PIXEL 669","R","03","6-46"]
[null,"0x9EDF",40671,1,"signed","Temperature of PIXEL 670","R","03","6-47"]
[null,"0x9EE0",40672,1,"signed","Temperature of PIXEL 671","R","03","6-48"]
[null,"0x9EE1",40673,1,"signed","Temperature of PIXEL 672","R","03","6-49"]
[null,"0x9EE2",40674,1,"signed","Temperature of PIXEL 673","R","03","6-50"]
[null,"0x9EE3",40675,1,"signed","Temperature of PIXEL 674","R","03","6-51"]
[null,"0x9EE4",40676,1,"signed","Temperature of PIXEL 675","R","03","6-52"]
[null,"0x9EE5",40677,1,"signed","Temperature of PIXEL 676","R","03","6-53"]
[null,"0x9EE6",40678,1,"signed","Temperature of PIXEL 677","R","03","6-54"]
[null,"0x9EE7",40679,1,"signed","Temperature of PIXEL 678","R","03","6-55"]
[null,"0x9EE8",40680,1,"signed","Temperature of PIXEL 679","R","03","6-56"]
[null,"0x9EE9",40681,1,"signed","Temperature of PIXEL 680","R","03","6-57"]
[null,"0x9EEA",40682,1,"signed","Temperature of PIXEL 681","R","03","6-58"]
[null,"0x9EEB",40683,1,"signed","Temperature of PIXEL 682","R","03","6-59"]
[null,"0x9EEC",40684,1,"signed","Temperature of PIXEL 683","R","03","6-60"]
[null,"0x9EED",40685,1,"signed","Temperature of PIXEL 684","R","03","6-61"]
[null,"0x9EEE",40686,1,"signed","Temperature of PIXEL 685","R","03","6-62"]
[null,"0x9EEF",40687,1,"signed","Temperature of PIXEL 686","R","03","6-63"]
[null,"0x9EF0",40688,1,"signed","Temperature of PIXEL 687","R","03","6-64"]
[null,"0x9EF1",40689,1,"signed","Temperature of PIXEL 688","R","03","6-65"]
[null,"0x9EF2",40690,1,"signed","Temperature of PIXEL 689","R","03","6-66"]
[null,"0x9EF3",40691,1,"signed","Temperature of PIXEL 690","R","03","6-67"]
[null,"0x9EF4",40692,1,"signed","Temperature of PIXEL 691","R","03","6-68"]
[null,"0x9EF5",40693,1,"signed","Temperature of PIXEL 692","R","03","6-69"]
[null,"0x9EF6",40694,1,"signed","Temperature of PIXEL 693","R","03","6-70"]
[null,"0x9EF7",40695,1,"signed","Temperature of PIXEL 694","R","03","6-71"]
[null,"0x9EF8",40696,1,"signed","Temperature of PIXEL 695","R","03","6-72"]
[null,"0x9EF9",40697,1,"signed","Temperature of PIXEL 696","R","03","6-73"]
[null,"0x9EFA",40698,1,"signed","Temperature of PIXEL 697","R","03","6-74"]
[null,"0x9EFB",40699,1,"signed","Temperature of PIXEL 698","R","03","6-75"]
[null,"0x9EFC",40700,1,"signed","Temperature of PIXEL 699","R","03","6-76"]
[null,"0x9EFD",40701,1,"signed","Temperature of PIXEL 700","R","03","6-77"]
[null,"0x9EFE",40702,1,"signed","Temperature of PIXEL 701","R","03","6-78"]
[null,{"$f":"\"0x\"&(DEC2HEX(C710))","v":"0x9EFF"},40703,1,"signed","Temperature of PIXEL 702","R","03","6-79"]
[null,"0x9F00",40704,1,"signed","Temperature of PIXEL 703","R","03","6-80"]
[null,"0x9F01",40705,1,"signed","Temperature of PIXEL 704","R","03","6-81"]
[null,"0x9F02",40706,1,"signed","Temperature of PIXEL 705","R","03","6-82"]
[null,"0x9F03",40707,1,"signed","Temperature of PIXEL 706","R","03","6-83"]
[null,"0x9F04",40708,1,"signed","Temperature of PIXEL 707","R","03","6-84"]
[null,"0x9F05",40709,1,"signed","Temperature of PIXEL 708","R","03","6-85"]
[null,"0x9F06",40710,1,"signed","Temperature of PIXEL 709","R","03","6-86"]
[null,"0x9F07",40711,1,"signed","Temperature of PIXEL 710","R","03","6-87"]
[null,"0x9F08",40712,1,"signed","Temperature of PIXEL 711","R","03","6-88"]
[null,"0x9F09",40713,1,"signed","Temperature of PIXEL 712","R","03","6-89"]
[null,"0x9F0A",40714,1,"signed","Temperature of PIXEL 713","R","03","6-90"]
[null,"0x9F0B",40715,1,"signed","Temperature of PIXEL 714","R","03","6-91"]
[null,"0x9F0C",40716,1,"signed","Temperature of PIXEL 715","R","03","6-92"]
[null,"0x9F0D",40717,1,"signed","Temperature of PIXEL 716","R","03","6-93"]
[null,"0x9F0E",40718,1,"signed","Temperature of PIXEL 717","R","03","6-94"]
[null,"0x9F0F",40719,1,"signed","Temperature of PIXEL 718","R","03","6-95"]
[null,"0x9F10",40720,1,"signed","Temperature of PIXEL 719","R","03","6-96"]
[null,"0x9F11",40721,1,"signed","Temperature of PIXEL 720","R","03","6-97"]
[null,"0x9F12",40722,1,"signed","Temperature of PIXEL 721","R","03","6-98"]
[null,"0x9F13",40723,1,"signed","Temperature of PIXEL 722","R","03","6-99"]
[null,"0x9F14",40724,1,"signed","Temperature of PIXEL 723","R","03","6-100"]
[null,"0x9F15",40725,1,"signed","Temperature of PIXEL 724","R","03","6-101"]
[null,"0x9F16",40726,1,"signed","Temperature of PIXEL 725","R","03","6-102"]
[null,"0x9F17",40727,1,"signed","Temperature of PIXEL 726","R","03","6-103"]
[null,"0x9F18",40728,1,"signed","Temperature of PIXEL 727","R","03","6-104"]
[null,"0x9F19",40729,1,"signed","Temperature of PIXEL 728","R","03","6-105"]
[null,"0x9F1A",40730,1,"signed","Temperature of PIXEL 729","R","03","6-106"]
[null,"0x9F1B",40731,1,"signed","Temperature of PIXEL 730","R","03","6-107"]
[null,"0x9F1C",40732,1,"signed","Temperature of PIXEL 731","R","03","6-108"]
[null,"0x9F1D",40733,1,"signed","Temperature of PIXEL 732","R","03","6-109"]
[null,"0x9F1E",40734,1,"signed","Temperature of PIXEL 733","R","03","6-110"]
[null,"0x9F1F",40735,1,"signed","Temperature of PIXEL 734","R","03","6-111"]
[null,"0x9F20",40736,1,"signed","Temperature of PIXEL 735","R","03","6-112"]
[null,"0x9F21",40737,1,"signed","Temperature of PIXEL 736","R","03","6-113"]
[null,"0x9F22",40738,1,"signed","Temperature of PIXEL 737","R","03","6-114"]
[null,"0x9F23",40739,1,"signed","Temperature of PIXEL 738","R","03","6-115"]
[null,"0x9F24",40740,1,"signed","Temperature of PIXEL 739","R","03","6-116"]
[null,"0x9F25",40741,1,"signed","Temperature of PIXEL 740","R","03","6-117"]
[null,"0x9F26",40742,1,"signed","Temperature of PIXEL 741","R","03","6-118"]
[null,"0x9F27",40743,1,"signed","Temperature of PIXEL 742","R","03","6-119"]
[null,"0x9F28",40744,1,"signed","Temperature of PIXEL 743","R","03","6-120"]
[null,"0x9F29",40745,1,"signed","Temperature of PIXEL 744","R","03","6-121"]
[null,"0x9F2A",40746,1,"signed","Temperature of PIXEL 745","R","03","6-122"]
[null,"0x9F2B",40747,1,"signed","Temperature of PIXEL 746","R","03","6-123"]
[null,"0x9F2C",40748,1,"signed","Temperature of PIXEL 747","R","03","6-124"]
[null,"0x9F2D",40749,1,"signed","Temperature of PIXEL 748","R","03","6-125"]
[null,"0x9F2E",40750,1,"signed","Temperature of PIXEL 749","R","03","7-1"]
[null,"0x9F2F",40751,1,"signed","Temperature of PIXEL 750","R","03","7-2"]
[null,"0x9F30",40752,1,"signed","Temperature of PIXEL 751","R","03","7-3"]
[null,"0x9F31",40753,1,"signed","Temperature of PIXEL 752","R","03","7-4"]
[null,"0x9F32",40754,1,"signed","Temperature of PIXEL 753","R","03","7-5"]
[null,"0x9F33",40755,1,"signed","Temperature of PIXEL 754","R","03","7-6"]
[null,"0x9F34",40756,1,"signed","Temperature of PIXEL 755","R","03","7-7"]
[null,"0x9F35",40757,1,"signed","Temperature of PIXEL 756","R","03","7-8"]
[null,"0x9F36",40758,1,"signed","Temperature of PIXEL 757","R","03","7-9"]
[null,"0x9F37",40759,1,"signed","Temperature of PIXEL 758","R","03","7-10"]
[null,"0x9F38",40760,1,"signed","Temperature of PIXEL 759","R","03","7-11"]
[null,"0x9F39",40761,1,"signed","Temperature of PIXEL 760","R","03","7-12"]
[null,"0x9F3A",40762,1,"signed","Temperature of PIXEL 761","R","03","7-13"]
[null,"0x9F3B",40763,1,"signed","Temperature of PIXEL 762","R","03","7-14"]
[null,"0x9F3C",40764,1,"signed","Temperature of PIXEL 763","R","03","7-15"]
[null,"0x9F3D",40765,1,"signed","Temperature of PIXEL 764","R","03","7-16"]
[null,"0x9F3E",40766,1,"signed","Temperature of PIXEL 765","R","03","7-17"]
[null,{"$f":"\"0x\"&(DEC2HEX(C774))","v":"0x9F3F"},40767,1,"signed","Temperature of PIXEL 766","R","03","7-18"]
[null,"0x9F40",40768,1,"signed","Temperature of PIXEL 767","R","03","7-19"]
[null,"0x9F41",40769,1,"signed","Temperature of PIXEL 768","R","03","7-20"]
[null,"0x9F42",40770,1,"signed","Temperature of PIXEL 769","R","03","7-21"]
[null,"0x9F43",40771,1,"signed","Temperature of PIXEL 770","R","03","7-22"]
[null,"0x9F44",40772,1,"signed","Temperature of PIXEL 771","R","03","7-23"]
[null,"0x9F45",40773,1,"signed","Temperature of PIXEL 772","R","03","7-24"]
[null,"0x9F46",40774,1,"signed","Temperature of PIXEL 773","R","03","7-25"]
[null,"0x9F47",40775,1,"signed","Temperature of PIXEL 774","R","03","7-26"]
[null,"0x9F48",40776,1,"signed","Temperature of PIXEL 775","R","03","7-27"]
[null,"0x9F49",40777,1,"signed","Temperature of PIXEL 776","R","03","7-28"]
[null,"0x9F4A",40778,1,"signed","Temperature of PIXEL 777","R","03","7-29"]
[null,"0x9F4B",40779,1,"signed","Temperature of PIXEL 778","R","03","7-30"]
[null,"0x9F4C",40780,1,"signed","Temperature of PIXEL 779","R","03","7-31"]
[null,"0x9F4D",40781,1,"signed","Temperature of PIXEL 780","R","03","7-32"]
[null,"0x9F4E",40782,1,"signed","Temperature of PIXEL 781","R","03","7-33"]
[null,"0x9F4F",40783,1,"signed","Temperature of PIXEL 782","R","03","7-34"]
[null,"0x9F50",40784,1,"signed","Temperature of PIXEL 783","R","03","7-35"]
[null,"0x9F51",40785,1,"signed","Temperature of PIXEL 784","R","03","7-36"]
[null,"0x9F52",40786,1,"signed","Temperature of PIXEL 785","R","03","7-37"]
[null,"0x9F53",40787,1,"signed","Temperature of PIXEL 786","R","03","7-38"]
[null,"0x9F54",40788,1,"signed","Temperature of PIXEL 787","R","03","7-39"]
[null,"0x9F55",40789,1,"signed","Temperature of PIXEL 788","R","03","7-40"]
[null,"0x9F56",40790,1,"signed","Temperature of PIXEL 789","R","03","7-41"]
[null,"0x9F57",40791,1,"signed","Temperature of PIXEL 790","R","03","7-42"]
[null,"0x9F58",40792,1,"signed","Temperature of PIXEL 791","R","03","7-43"]
[null,"0x9F59",40793,1,"signed","Temperature of PIXEL 792","R","03","7-44"]
[null,"0x9F5A",40794,1,"signed","Temperature of PIXEL 793","R","03","7-45"]
[null,"0x9F5B",40795,1,"signed","Temperature of PIXEL 794","R","03","7-46"]
[null,"0x9F5C",40796,1,"signed","Temperature of PIXEL 795","R","03","7-47"]
[null,"0x9F5D",40797,1,"signed","Temperature of PIXEL 796","R","03","7-48"]
[null,"0x9F5E",40798,1,"signed","Temperature of PIXEL 797","R","03","7-49"]
[null,"0x9F5F",40799,1,"signed","Temperature of PIXEL 798","R","03","7-50"]
[null,"0x9F60",40800,1,"signed","Temperature of PIXEL 799","R","03","7-51"]
[null,"0x9F61",40801,1,"signed","Temperature of PIXEL 800","R","03","7-52"]
[null,"0x9F62",40802,1,"signed","Temperature of PIXEL 801","R","03","7-53"]
[null,"0x9F63",40803,1,"signed","Temperature of PIXEL 802","R","03","7-54"]
[null,"0x9F64",40804,1,"signed","Temperature of PIXEL 803","R","03","7-55"]
[null,"0x9F65",40805,1,"signed","Temperature of PIXEL 804","R","03","7-56"]
[null,"0x9F66",40806,1,"signed","Temperature of PIXEL 805","R","03","7-57"]
[null,"0x9F67",40807,1,"signed","Temperature of PIXEL 806","R","03","7-58"]
[null,"0x9F68",40808,1,"signed","Temperature of PIXEL 807","R","03","7-59"]
[null,"0x9F69",40809,1,"signed","Temperature of PIXEL 808","R","03","7-60"]
[null,"0x9F6A",40810,1,"signed","Temperature of PIXEL 809","R","03","7-61"]
[null,"0x9F6B",40811,1,"signed","Temperature of PIXEL 810","R","03","7-62"]
[null,"0x9F6C",40812,1,"signed","Temperature of PIXEL 811","R","03","7-63"]
[null,"0x9F6D",40813,1,"signed","Temperature of PIXEL 812","R","03","7-64"]
[null,"0x9F6E",40814,1,"signed","Temperature of PIXEL 813","R","03","7-65"]
[null,"0x9F6F",40815,1,"signed","Temperature of PIXEL 814","R","03","7-66"]
[null,"0x9F70",40816,1,"signed","Temperature of PIXEL 815","R","03","7-67"]
[null,"0x9F71",40817,1,"signed","Temperature of PIXEL 816","R","03","7-68"]
[null,"0x9F72",40818,1,"signed","Temperature of PIXEL 817","R","03","7-69"]
[null,"0x9F73",40819,1,"signed","Temperature of PIXEL 818","R","03","7-70"]
[null,"0x9F74",40820,1,"signed","Temperature of PIXEL 819","R","03","7-71"]
[null,"0x9F75",40821,1,"signed","Temperature of PIXEL 820","R","03","7-72"]
[null,"0x9F76",40822,1,"signed","Temperature of PIXEL 821","R","03","7-73"]
[null,"0x9F77",40823,1,"signed","Temperature of PIXEL 822","R","03","7-74"]
[null,"0x9F78",40824,1,"signed","Temperature of PIXEL 823","R","03","7-75"]
[null,"0x9F79",40825,1,"signed","Temperature of PIXEL 824","R","03","7-76"]
[null,"0x9F7A",40826,1,"signed","Temperature of PIXEL 825","R","03","7-77"]
[null,"0x9F7B",40827,1,"signed","Temperature of PIXEL 826","R","03","7-78"]
[null,"0x9F7C",40828,1,"signed","Temperature of PIXEL 827","R","03","7-79"]
[null,"0x9F7D",40829,1,"signed","Temperature of PIXEL 828","R","03","7-80"]
[null,"0x9F7E",40830,1,"signed","Temperature of PIXEL 829","R","03","7-81"]
[null,{"$f":"\"0x\"&(DEC2HEX(C838))","v":"0x9F7F"},40831,1,"signed","Temperature of PIXEL 830","R","03","7-82"]
[null,"0x9F80",40832,1,"signed","Temperature of PIXEL 831","R","03","7-83"]
[null,"0x9F81",40833,1,"signed","Temperature of PIXEL 832","R","03","7-84"]
[null,"0x9F82",40834,1,"signed","Temperature of PIXEL 833","R","03","7-85"]
[null,"0x9F83",40835,1,"signed","Temperature of PIXEL 834","R","03","7-86"]
[null,"0x9F84",40836,1,"signed","Temperature of PIXEL 835","R","03","7-87"]
[null,"0x9F85",40837,1,"signed","Temperature of PIXEL 836","R","03","7-88"]
[null,"0x9F86",40838,1,"signed","Temperature of PIXEL 837","R","03","7-89"]
[null,"0x9F87",40839,1,"signed","Temperature of PIXEL 838","R","03","7-90"]
[null,"0x9F88",40840,1,"signed","Temperature of PIXEL 839","R","03","7-91"]
[null,"0x9F89",40841,1,"signed","Temperature of PIXEL 840","R","03","7-92"]
[null,"0x9F8A",40842,1,"signed","Temperature of PIXEL 841","R","03","7-93"]
[null,"0x9F8B",40843,1,"signed","Temperature of PIXEL 842","R","03","7-94"]
[null,"0x9F8C",40844,1,"signed","Temperature of PIXEL 843","R","03","7-95"]
[null,"0x9F8D",40845,1,"signed","Temperature of PIXEL 844","R","03","7-96"]
[null,"0x9F8E",40846,1,"signed","Temperature of PIXEL 845","R","03","7-97"]
[null,"0x9F8F",40847,1,"signed","Temperature of PIXEL 846","R","03","7-98"]
[null,"0x9F90",40848,1,"signed","Temperature of PIXEL 847","R","03","7-99"]
[null,"0x9F91",40849,1,"signed","Temperature of PIXEL 848","R","03","7-100"]
[null,"0x9F92",40850,1,"signed","Temperature of PIXEL 849","R","03","7-101"]
[null,"0x9F93",40851,1,"signed","Temperature of PIXEL 850","R","03","7-102"]
[null,"0x9F94",40852,1,"signed","Temperature of PIXEL 851","R","03","7-103"]
[null,"0x9F95",40853,1,"signed","Temperature of PIXEL 852","R","03","7-104"]
[null,"0x9F96",40854,1,"signed","Temperature of PIXEL 853","R","03","7-105"]
[null,"0x9F97",40855,1,"signed","Temperature of PIXEL 854","R","03","7-106"]
[null,"0x9F98",40856,1,"signed","Temperature of PIXEL 855","R","03","7-107"]
[null,"0x9F99",40857,1,"signed","Temperature of PIXEL 856","R","03","7-108"]
[null,"0x9F9A",40858,1,"signed","Temperature of PIXEL 857","R","03","7-109"]
[null,"0x9F9B",40859,1,"signed","Temperature of PIXEL 858","R","03","7-110"]
[null,"0x9F9C",40860,1,"signed","Temperature of PIXEL 859","R","03","7-111"]
[null,"0x9F9D",40861,1,"signed","Temperature of PIXEL 860","R","03","7-112"]
[null,"0x9F9E",40862,1,"signed","Temperature of PIXEL 861","R","03","7-113"]
[null,"0x9F9F",40863,1,"signed","Temperature of PIXEL 862","R","03","7-114"]
[null,"0x9FA0",40864,1,"signed","Temperature of PIXEL 863","R","03","7-115"]
[null,"0x9FA1",40865,1,"signed","Temperature of PIXEL 864","R","03","7-116"]
[null,"0x9FA2",40866,1,"signed","Temperature of PIXEL 865","R","03","7-117"]
[null,"0x9FA3",40867,1,"signed","Temperature of PIXEL 866","R","03","7-118"]
[null,"0x9FA4",40868,1,"signed","Temperature of PIXEL 867","R","03","7-119"]
[null,"0x9FA5",40869,1,"signed","Temperature of PIXEL 868","R","03","7-120"]
[null,"0x9FA6",40870,1,"signed","Temperature of PIXEL 869","R","03","7-121"]
[null,"0x9FA7",40871,1,"signed","Temperature of PIXEL 870","R","03","7-122"]
[null,"0x9FA8",40872,1,"signed","Temperature of PIXEL 871","R","03","7-123"]
[null,"0x9FA9",40873,1,"signed","Temperature of PIXEL 872","R","03","7-124"]
[null,"0x9FAA",40874,1,"signed","Temperature of PIXEL 873","R","03","7-125"]
[null,"0x9FAB",40875,1,"signed","Temperature of PIXEL 874","R","03","8-1"]
[null,"0x9FAC",40876,1,"signed","Temperature of PIXEL 875","R","03","8-2"]
[null,"0x9FAD",40877,1,"signed","Temperature of PIXEL 876","R","03","8-3"]
[null,"0x9FAE",40878,1,"signed","Temperature of PIXEL 877","R","03","8-4"]
[null,"0x9FAF",40879,1,"signed","Temperature of PIXEL 878","R","03","8-5"]
[null,"0x9FB0",40880,1,"signed","Temperature of PIXEL 879","R","03","8-6"]
[null,"0x9FB1",40881,1,"signed","Temperature of PIXEL 880","R","03","8-7"]
[null,"0x9FB2",40882,1,"signed","Temperature of PIXEL 881","R","03","8-8"]
[null,"0x9FB3",40883,1,"signed","Temperature of PIXEL 882","R","03","8-9"]
[null,"0x9FB4",40884,1,"signed","Temperature of PIXEL 883","R","03","8-10"]
[null,"0x9FB5",40885,1,"signed","Temperature of PIXEL 884","R","03","8-11"]
[null,"0x9FB6",40886,1,"signed","Temperature of PIXEL 885","R","03","8-12"]
[null,"0x9FB7",40887,1,"signed","Temperature of PIXEL 886","R","03","8-13"]
[null,"0x9FB8",40888,1,"signed","Temperature of PIXEL 887","R","03","8-14"]
[null,"0x9FB9",40889,1,"signed","Temperature of PIXEL 888","R","03","8-15"]
[null,"0x9FBA",40890,1,"signed","Temperature of PIXEL 889","R","03","8-16"]
[null,"0x9FBB",40891,1,"signed","Temperature of PIXEL 890","R","03","8-17"]
[null,"0x9FBC",40892,1,"signed","Temperature of PIXEL 891","R","03","8-18"]
[null,"0x9FBD",40893,1,"signed","Temperature of PIXEL 892","R","03","8-19"]
[null,"0x9FBE",40894,1,"signed","Temperature of PIXEL 893","R","03","8-20"]
[null,{"$f":"\"0x\"&(DEC2HEX(C902))","v":"0x9FBF"},40895,1,"signed","Temperature of PIXEL 894","R","03","8-21"]
[null,"0x9FC0",40896,1,"signed","Temperature of PIXEL 895","R","03","8-22"]
[null,"0x9FC1",40897,1,"signed","Temperature of PIXEL 896","R","03","8-23"]
[null,"0x9FC2",40898,1,"signed","Temperature of PIXEL 897","R","03","8-24"]
[null,"0x9FC3",40899,1,"signed","Temperature of PIXEL 898","R","03","8-25"]
[null,"0x9FC4",40900,1,"signed","Temperature of PIXEL 899","R","03","8-26"]
[null,"0x9FC5",40901,1,"signed","Temperature of PIXEL 900","R","03","8-27"]
[null,"0x9FC6",40902,1,"signed","Temperature of PIXEL 901","R","03","8-28"]
[null,"0x9FC7",40903,1,"signed","Temperature of PIXEL 902","R","03","8-29"]
[null,"0x9FC8",40904,1,"signed","Temperature of PIXEL 903","R","03","8-30"]
[null,"0x9FC9",40905,1,"signed","Temperature of PIXEL 904","R","03","8-31"]
[null,"0x9FCA",40906,1,"signed","Temperature of PIXEL 905","R","03","8-32"]
[null,"0x9FCB",40907,1,"signed","Temperature of PIXEL 906","R","03","8-33"]
[null,"0x9FCC",40908,1,"signed","Temperature of PIXEL 907","R","03","8-34"]
[null,"0x9FCD",40909,1,"signed","Temperature of PIXEL 908","R","03","8-35"]
[null,"0x9FCE",40910,1,"signed","Temperature of PIXEL 909","R","03","8-36"]
[null,"0x9FCF",40911,1,"signed","Temperature of PIXEL 910","R","03","8-37"]
[null,"0x9FD0",40912,1,"signed","Temperature of PIXEL 911","R","03","8-38"]
[null,"0x9FD1",40913,1,"signed","Temperature of PIXEL 912","R","03","8-39"]
[null,"0x9FD2",40914,1,"signed","Temperature of PIXEL 913","R","03","8-40"]
[null,"0x9FD3",40915,1,"signed","Temperature of PIXEL 914","R","03","8-41"]
[null,"0x9FD4",40916,1,"signed","Temperature of PIXEL 915","R","03","8-42"]
[null,"0x9FD5",40917,1,"signed","Temperature of PIXEL 916","R","03","8-43"]
[null,"0x9FD6",40918,1,"signed","Temperature of PIXEL 917","R","03","8-44"]
[null,"0x9FD7",40919,1,"signed","Temperature of PIXEL 918","R","03","8-45"]
[null,"0x9FD8",40920,1,"signed","Temperature of PIXEL 919","R","03","8-46"]
[null,"0x9FD9",40921,1,"signed","Temperature of PIXEL 920","R","03","8-47"]
[null,"0x9FDA",40922,1,"signed","Temperature of PIXEL 921","R","03","8-48"]
[null,"0x9FDB",40923,1,"signed","Temperature of PIXEL 922","R","03","8-49"]
[null,"0x9FDC",40924,1,"signed","Temperature of PIXEL 923","R","03","8-50"]
[null,"0x9FDD",40925,1,"signed","Temperature of PIXEL 924","R","03","8-51"]
[null,"0x9FDE",40926,1,"signed","Temperature of PIXEL 925","R","03","8-52"]
[null,"0x9FDF",40927,1,"signed","Temperature of PIXEL 926","R","03","8-53"]
[null,"0x9FE0",40928,1,"signed","Temperature of PIXEL 927","R","03","8-54"]
[null,"0x9FE1",40929,1,"signed","Temperature of PIXEL 928","R","03","8-55"]
[null,"0x9FE2",40930,1,"signed","Temperature of PIXEL 929","R","03","8-56"]
[null,"0x9FE3",40931,1,"signed","Temperature of PIXEL 930","R","03","8-57"]
[null,"0x9FE4",40932,1,"signed","Temperature of PIXEL 931","R","03","8-58"]
[null,"0x9FE5",40933,1,"signed","Temperature of PIXEL 932","R","03","8-59"]
[null,"0x9FE6",40934,1,"signed","Temperature of PIXEL 933","R","03","8-60"]
[null,"0x9FE7",40935,1,"signed","Temperature of PIXEL 934","R","03","8-61"]
[null,"0x9FE8",40936,1,"signed","Temperature of PIXEL 935","R","03","8-62"]
[null,"0x9FE9",40937,1,"signed","Temperature of PIXEL 936","R","03","8-63"]
[null,"0x9FEA",40938,1,"signed","Temperature of PIXEL 937","R","03","8-64"]
[null,"0x9FEB",40939,1,"signed","Temperature of PIXEL 938","R","03","8-65"]
[null,"0x9FEC",40940,1,"signed","Temperature of PIXEL 939","R","03","8-66"]
[null,"0x9FED",40941,1,"signed","Temperature of PIXEL 940","R","03","8-67"]
[null,"0x9FEE",40942,1,"signed","Temperature of PIXEL 941","R","03","8-68"]
[null,"0x9FEF",40943,1,"signed","Temperature of PIXEL 942","R","03","8-69"]
[null,"0x9FF0",40944,1,"signed","Temperature of PIXEL 943","R","03","8-70"]
[null,"0x9FF1",40945,1,"signed","Temperature of PIXEL 944","R","03","8-71"]
[null,"0x9FF2",40946,1,"signed","Temperature of PIXEL 945","R","03","8-72"]
[null,"0x9FF3",40947,1,"signed","Temperature of PIXEL 946","R","03","8-73"]
[null,"0x9FF4",40948,1,"signed","Temperature of PIXEL 947","R","03","8-74"]
[null,"0x9FF5",40949,1,"signed","Temperature of PIXEL 948","R","03","8-75"]
[null,"0x9FF6",40950,1,"signed","Temperature of PIXEL 949","R","03","8-76"]
[null,"0x9FF7",40951,1,"signed","Temperature of PIXEL 950","R","03","8-77"]
[null,"0x9FF8",40952,1,"signed","Temperature of PIXEL 951","R","03","8-78"]
[null,"0x9FF9",40953,1,"signed","Temperature of PIXEL 952","R","03","8-79"]
[null,"0x9FFA",40954,1,"signed","Temperature of PIXEL 953","R","03","8-80"]
[null,"0x9FFB",40955,1,"signed","Temperature of PIXEL 954","R","03","8-81"]
[null,"0x9FFC",40956,1,"signed","Temperature of PIXEL 955","R","03","8-82"]
[null,"0x9FFD",40957,1,"signed","Temperature of PIXEL 956","R","03","8-83"]
[null,"0x9FFE",40958,1,"signed","Temperature of PIXEL 957","R","03","8-84"]
[null,{"$f":"\"0x\"&(DEC2HEX(C966))","v":"0x9FFF"},40959,1,"signed","Temperature of PIXEL 958","R","03","8-85"]
[null,"0xA000",40960,1,"signed","Temperature of PIXEL 959","R","03","8-86"]
[null,"0xA001",40961,1,"signed","Temperature of PIXEL 960","R","03","8-87"]
[null,"0xA002",40962,1,"signed","Temperature of PIXEL 961","R","03","8-88"]
[null,"0xA003",40963,1,"signed","Temperature of PIXEL 962","R","03","8-89"]
[null,"0xA004",40964,1,"signed","Temperature of PIXEL 963","R","03","8-90"]
[null,"0xA005",40965,1,"signed","Temperature of PIXEL 964","R","03","8-91"]
[null,"0xA006",40966,1,"signed","Temperature of PIXEL 965","R","03","8-92"]
[null,"0xA007",40967,1,"signed","Temperature of PIXEL 966","R","03","8-93"]
[null,"0xA008",40968,1,"signed","Temperature of PIXEL 967","R","03","8-94"]
[null,"0xA009",40969,1,"signed","Temperature of PIXEL 968","R","03","8-95"]
[null,"0xA00A",40970,1,"signed","Temperature of PIXEL 969","R","03","8-96"]
[null,"0xA00B",40971,1,"signed","Temperature of PIXEL 970","R","03","8-97"]
[null,"0xA00C",40972,1,"signed","Temperature of PIXEL 971","R","03","8-98"]
[null,"0xA00D",40973,1,"signed","Temperature of PIXEL 972","R","03","8-99"]
[null,"0xA00E",40974,1,"signed","Temperature of PIXEL 973","R","03","8-100"]
[null,"0xA00F",40975,1,"signed","Temperature of PIXEL 974","R","03","8-101"]
[null,"0xA010",40976,1,"signed","Temperature of PIXEL 975","R","03","8-102"]
[null,"0xA011",40977,1,"signed","Temperature of PIXEL 976","R","03","8-103"]
[null,"0xA012",40978,1,"signed","Temperature of PIXEL 977","R","03","8-104"]
[null,"0xA013",40979,1,"signed","Temperature of PIXEL 978","R","03","8-105"]
[null,"0xA014",40980,1,"signed","Temperature of PIXEL 979","R","03","8-106"]
[null,"0xA015",40981,1,"signed","Temperature of PIXEL 980","R","03","8-107"]
[null,"0xA016",40982,1,"signed","Temperature of PIXEL 981","R","03","8-108"]
[null,"0xA017",40983,1,"signed","Temperature of PIXEL 982","R","03","8-109"]
[null,"0xA018",40984,1,"signed","Temperature of PIXEL 983","R","03","8-110"]
[null,"0xA019",40985,1,"signed","Temperature of PIXEL 984","R","03","8-111"]
[null,"0xA01A",40986,1,"signed","Temperature of PIXEL 985","R","03","8-112"]
[null,"0xA01B",40987,1,"signed","Temperature of PIXEL 986","R","03","8-113"]
[null,"0xA01C",40988,1,"signed","Temperature of PIXEL 987","R","03","8-114"]
[null,"0xA01D",40989,1,"signed","Temperature of PIXEL 988","R","03","8-115"]
[null,"0xA01E",40990,1,"signed","Temperature of PIXEL 989","R","03","8-116"]
[null,"0xA01F",40991,1,"signed","Temperature of PIXEL 990","R","03","8-117"]
[null,"0xA020",40992,1,"signed","Temperature of PIXEL 991","R","03","8-118"]
[null,"0xA021",40993,1,"signed","Temperature of PIXEL 992","R","03","8-119"]
[null,"0xA022",40994,1,"signed","Temperature of PIXEL 993","R","03","8-120"]
[null,"0xA023",40995,1,"signed","Temperature of PIXEL 994","R","03","8-121"]
[null,"0xA024",40996,1,"signed","Temperature of PIXEL 995","R","03","8-122"]
[null,"0xA025",40997,1,"signed","Temperature of PIXEL 996","R","03","8-123"]
[null,"0xA026",40998,1,"signed","Temperature of PIXEL 997","R","03","8-124"]
[null,"0xA027",40999,1,"signed","Temperature of PIXEL 998","R","03","8-125"]
[null,"0xA028",41000,1,"signed","Temperature of PIXEL 999","R","03","9-1"]
[null,"0xA029",41001,1,"signed","Temperature of PIXEL 1000","R","03","9-2"]
[null,"0xA02A",41002,1,"signed","Temperature of PIXEL 1001","R","03","9-3"]
[null,"0xA02B",41003,1,"signed","Temperature of PIXEL 1002","R","03","9-4"]
[null,"0xA02C",41004,1,"signed","Temperature of PIXEL 1003","R","03","9-5"]
[null,"0xA02D",41005,1,"signed","Temperature of PIXEL 1004","R","03","9-6"]
[null,"0xA02E",41006,1,"signed","Temperature of PIXEL 1005","R","03","9-7"]
[null,"0xA02F",41007,1,"signed","Temperature of PIXEL 1006","R","03","9-8"]
[null,"0xA030",41008,1,"signed","Temperature of PIXEL 1007","R","03","9-9"]
[null,"0xA031",41009,1,"signed","Temperature of PIXEL 1008","R","03","9-10"]
[null,"0xA032",41010,1,"signed","Temperature of PIXEL 1009","R","03","9-11"]
[null,"0xA033",41011,1,"signed","Temperature of PIXEL 1010","R","03","9-12"]
[null,"0xA034",41012,1,"signed","Temperature of PIXEL 1011","R","03","9-13"]
[null,"0xA035",41013,1,"signed","Temperature of PIXEL 1012","R","03","9-14"]
[null,"0xA036",41014,1,"signed","Temperature of PIXEL 1013","R","03","9-15"]
[null,"0xA037",41015,1,"signed","Temperature of PIXEL 1014","R","03","9-16"]
[null,"0xA038",41016,1,"signed","Temperature of PIXEL 1015","R","03","9-17"]
[null,"0xA039",41017,1,"signed","Temperature of PIXEL 1016","R","03","9-18"]
[null,"0xA03A",41018,1,"signed","Temperature of PIXEL 1017","R","03","9-19"]
[null,"0xA03B",41019,1,"signed","Temperature of PIXEL 1018","R","03","9-20"]
[null,"0xA03C",41020,1,"signed","Temperature of PIXEL 1019","R","03","9-21"]
[null,"0xA03D",41021,1,"signed","Temperature of PIXEL 1020","R","03","9-22"]
[null,"0xA03E",41022,1,"signed","Temperature of PIXEL 1021","R","03","9-23"]
[null,{"$f":"\"0x\"&(DEC2HEX(C1030))","v":"0xA03F"},41023,1,"signed","Temperature of PIXEL 1022","R","03","9-24"]
[null,"0xA040",41024,1,"signed","Temperature of PIXEL 1023","R","03","9-25"]

{"sheet":"프로토콜","index":1,"n_rows":43,"n_cols":17,"rows_kept":43,"cut":false,"hidden":false,"merged":[[26,13,26,14],[26,16,27,16],[27,13,27,14],[28,14,29,14],[21,13,21,14],[22,13,22,14],[23,13,23,14],[24,13,24,14],[24,16,25,16],[25,13,25,14],[15,13,15,14],[16,13,16,14],[17,13,17,14],[19,13,19,16],[11,13,11,14],[12,13,12,14],[13,13,13,14],[14,13,14,14],[0,1,0,6],[6,13,6,16],[8,13,8,14],[9,13,9,14],[10,13,10,14],[26,2,26,3],[26,5,27,5],[27,2,27,3],[28,3,29,3],[26,7,27,10],[26,6,27,6],[19,2,19,5],[21,2,21,3],[22,2,22,3],[23,2,23,3],[24,2,24,3],[24,5,25,5],[25,2,25,3],[13,6,14,6],[6,2,6,5],[10,7,12,10],[8,2,8,3],[13,7,14,10],[13,2,13,3],[14,2,14,3],[15,3,16,3],[11,5,12,5],[13,5,14,5],[9,2,9,3],[10,2,10,3],[11,2,11,3],[12,2,12,3],[37,13,37,14],[32,2,32,5],[32,13,32,16],[34,2,34,3],[34,13,34,14],[35,2,35,3],[35,13,35,14],[41,3,42,3],[41,14,42,14],[35,7,36,10],[37,16,38,16],[38,2,38,3],[38,13,38,14],[39,2,39,3],[39,5,40,5],[39,13,39,14],[39,16,40,16],[40,2,40,3],[40,13,40,14],[36,2,36,3],[36,13,36,14],[37,2,37,3],[37,5,38,5]]}
[null,"※ Sheet(\"MAP\")의 1. ADDRESS MAP과 같이 보시기 바랍니다. "]
[null,"※ 아래 사진과 같은 매크로 관련 보안 메시지가 뜬다면 꼭 허용해 주시기 바랍니다. CRC 연산/ 비트연산 매크로가 사용됐습니다."]
[]
[]
[]
[]
[null,null,"1. 온도데이터 READ REQUEST",null,null,null,null,null,null,null,null,null,null,"1. 온도데이터 READ RESPONSE"]
[]
[null,null,"Field Name",null,"HEX","DEC",null,null,null,null,null,null,null,"Field Name",null,"HEX","DEC"]
[null,0,"ID",null,{"$f":"IF((F10)<16,\"0\"&DEC2HEX(F10),DEC2HEX(F10))","v":"01"},1,null,null,null,null,null,null,0,"ID",null,{"$f":"IF((Q10)<16,\"0\"&DEC2HEX(Q10),DEC2HEX(Q10))","v":"01"},{"$f":"F10","v":1}]
[null,1,"Function",null,{"$f":"IF((F11)<16,\"0\"&DEC2HEX(F11),DEC2HEX(F11))","v":"03"},3,null,"              내부의 값을 수정하면 \nHEX값이 자동으로 바뀝니다.\n다른 부분은 수정하지 마십시오",null,null,null,null,1,"Function",null,{"$f":"IF((Q11)<16,\"0\"&DEC2HEX(Q11),DEC2HEX(Q11))","v":"03"},{"$f":"F11","v":3}]
[null,2,"Register Address Hi",null,{"$f":"IF(TRUNC(F12/256)<16,\"0\"&DEC2HEX(TRUNC(F12/256)),DEC2HEX(TRUNC(F12/256)))","v":"9C"},40000,"◀◀◀◀",null,null,null,null,null,2,"Byte Count",null,{"$f":"IF((Q12)<16,\"0\"&DEC2HEX(Q12),DEC2HEX(Q12))","v":"32"},{"$f":"F14*2","v":50}]
[null,3,"Register Address Lo",null,{"$f":"IF(BITMASK(F12)<16,\"0\"&DEC2HEX(BITMASK(F12)),DEC2HEX(BITMASK(F12)))","v":"40"},null,null,null,null,null,null,null,3,"Register Value Hi"]
[null,4,"Register Value Hi",null,"00",25,{"$f":"IF( ((41024-F12)>=F14-1),IF(F14<>0,\"PASS\",\"ERROR\"),\"ERROR\")","v":"PASS"},"\"PASS\" : 설정값에 문제 없음.\n\"ERROR\" : 설정값에 문제 있음.",null,null,null,null,4,"Register Value Lo"]
[null,5,"Register Value Lo",null,{"$f":"IF((F14)<16,\"0\"&DEC2HEX(F14),DEC2HEX(F14))","v":"19"},null,null,null,null,null,null,null,"〯","〯",null,"〯"]
[null,6,"CRC",{"$f":"CRC(E10&E11&E12&E13&E14&E15)","v":"84AB"},{"$f":"MID(D16,3,2)","v":"AB"},null,null,null,null,null,null,null,"〯","〯",null,"〯"]
[null,7,"CRC",null,{"$f":"MID(D16,1,2)","v":"84"},null,null,null,null,null,null,null,null,"CRC"]
[null,null,null,null,null,null,null,null,null,null,null,null,null,"CRC"]
[]
[null,null,"2. ID Write REQUEST",null,null,null,null,null,null,null,null,null,null,"2. ID Write RESPONSE"]
[]
[null,null,"Field Name",null,"HEX","DEC",null,null,null,null,null,null,null,"Field Name",null,"HEX","DEC"]
[null,0,"ID",null,{"$f":"IF((F23)<16,\"0\"&DEC2HEX(F23),DEC2HEX(F23))","v":"FF"},255,null,null,null,null,null,null,0,"ID",null,{"$f":"IF((Q23)<16,\"0\"&DEC2HEX(Q23),DEC2HEX(Q23))","v":"FF"},255]
[null,1,"Function",null,{"$f":"IF((F24)<16,\"0\"&DEC2HEX(F24),DEC2HEX(F24))","v":"06"},6,null,null,null,null,null,null,1,"Function",null,{"$f":"IF((Q24)<16,\"0\"&DEC2HEX(Q24),DEC2HEX(Q24))","v":"06"},6]
[null,2,"Register Address Hi",null,{"$f":"IF(TRUNC(F25/256)<16,\"0\"&DEC2HEX(TRUNC(F25/256)),DEC2HEX(TRUNC(F25/256)))","v":"03"},1000,null,null,null,null,null,null,2,"Register Address Hi",null,{"$f":"IF(TRUNC(Q25/256)<16,\"0\"&DEC2HEX(TRUNC(Q25/256)),DEC2HEX(TRUNC(Q25/256)))","v":"03"},1000]
[null,3,"Register Address Lo",null,{"$f":"IF(BITMASK(F25)<16,\"0\"&DEC2HEX(BITMASK(F25)),DEC2HEX(BITMASK(F25)))","v":"E8"},null,null,null,null,null,null,null,3,"Register Address Lo",null,{"$f":"IF(BITMASK(Q25)<16,\"0\"&DEC2HEX(BITMASK(Q25)),DEC2HEX(BITMASK(Q25)))","v":"E8"}]
[null,4,"Register Value Hi",null,"00",5,"◀◀◀◀","굵은 테두리 안의 값만 수정 가능합니다.\nID는 1~200 까지만 가능합니다",null,null,null,null,4,"Register Value Hi",null,"00",{"$f":"F27","v":5}]
[null,5,"Register Value Lo",null,{"$f":"IF((F27)<16,\"0\"&DEC2HEX(F27),DEC2HEX(F27))","v":"05"},null,null,null,null,null,null,null,5,"Register Value Lo",null,{"$f":"IF((Q27)<16,\"0\"&DEC2HEX(Q27),DEC2HEX(Q27))","v":"05"}]
[null,6,"CRC",{"$f":"CRC(E23&E24&E25&E26&E27&E28)","v":"67DC"},{"$f":"MID(D29,3,2)","v":"DC"},null,null,null,null,null,null,null,6,"CRC",{"$f":"CRC(P23&P24&P25&P26&P27&P28)","v":"67DC"},{"$f":"MID(O29,3,2)","v":"DC"}]
[null,7,"CRC",null,{"$f":"MID(D29,1,2)","v":"67"},null,null,null,null,null,null,null,7,"CRC",null,{"$f":"MID(O29,1,2)","v":"67"}]
[]
[]
[null,null,"3. Reboot REQUEST",null,null,null,null,null,null,null,null,null,null,"2. Reboot RESPONSE"]
[]
[null,null,"Field Name",null,"HEX","DEC",null,null,null,null,null,null,null,"Field Name",null,"HEX","DEC"]
[null,0,"ID",null,{"$f":"IF((F36)<16,\"0\"&DEC2HEX(F36),DEC2HEX(F36))","v":"01"},1,"◀◀◀◀","굵은 테두리 안의 값만 수정 가능합니다.\nID는 1~200 까지만 가능합니다",null,null,null,null,0,"ID",null,{"$f":"IF((Q36)<16,\"0\"&DEC2HEX(Q36),DEC2HEX(Q36))","v":"01"},{"$f":"F36","v":1}]
[null,1,"Function",null,{"$f":"IF((F37)<16,\"0\"&DEC2HEX(F37),DEC2HEX(F37))","v":"06"},6,null,null,null,null,null,null,1,"Function",null,{"$f":"IF((Q37)<16,\"0\"&DEC2HEX(Q37),DEC2HEX(Q37))","v":"06"},6]
[null,2,"Register Address Hi",null,{"$f":"IF(TRUNC(F38/256)<16,\"0\"&DEC2HEX(TRUNC(F38/256)),DEC2HEX(TRUNC(F38/256)))","v":"03"},1001,null,null,null,null,null,null,2,"Register Address Hi",null,{"$f":"IF(TRUNC(Q38/256)<16,\"0\"&DEC2HEX(TRUNC(Q38/256)),DEC2HEX(TRUNC(Q38/256)))","v":"03"},1001]
[null,3,"Register Address Lo",null,{"$f":"IF(BITMASK(F38)<16,\"0\"&DEC2HEX(BITMASK(F38)),DEC2HEX(BITMASK(F38)))","v":"E9"},null,null,null,null,null,null,null,3,"Register Address Lo",null,{"$f":"IF(BITMASK(Q38)<16,\"0\"&DEC2HEX(BITMASK(Q38)),DEC2HEX(BITMASK(Q38)))","v":"E9"}]
[null,4,"Register Value Hi",null,"00",1,null,null,null,null,null,null,4,"Register Value Hi",null,"00",{"$f":"F40","v":1}]
[null,5,"Register Value Lo",null,{"$f":"IF((F40)<16,\"0\"&DEC2HEX(F40),DEC2HEX(F40))","v":"01"},null,null,null,null,null,null,null,5,"Register Value Lo",null,{"$f":"IF((Q40)<16,\"0\"&DEC2HEX(Q40),DEC2HEX(Q40))","v":"01"}]
[null,6,"CRC",{"$f":"CRC(E36&E37&E38&E39&E40&E41)","v":"BA99"},{"$f":"MID(D42,3,2)","v":"99"},null,null,null,null,null,null,null,6,"CRC",{"$f":"CRC(P36&P37&P38&P39&P40&P41)","v":"BA99"},{"$f":"MID(O42,3,2)","v":"99"}]
[null,7,"CRC",null,{"$f":"MID(D42,1,2)","v":"BA"},null,null,null,null,null,null,null,7,"CRC",null,{"$f":"MID(O42,1,2)","v":"BA"}]

{"sheet":"CRC16","index":2,"n_rows":168,"n_cols":28,"rows_kept":168,"cut":false,"hidden":false,"merged":[[1,2,1,17]]}
[null,null,"input hex string",null,null,null,null,null,null,null,null,null,null,null,null,null,null,null,null,null,"#bytes",null,"crc"]
[null,null,"0103044C0001",null,null,null,null,null,null,null,null,null,null,null,null,null,null,null,null,null,{"$f":"LEN(C2)/2","v":6},null,{"$f":"VLOOKUP(U2,T17:W168,4)","v":"44ED"}]
[]
[null,null,null,1,2,3,4,5,6,7,8,9,10,11,12,13,14,15,16]
[null,null,"xor constant",1,0,1,0,0,0,0,0,0,0,0,0,0,0,0,1,null,null,null,"xor with this constant if the shifted bit was 1"]
[]
["byte#","Hex","Start with 16 trues",1,1,1,1,1,1,1,1,1,1,1,1,1,1,1,1]
[1,{"$f":"MID(C$2,1,2)","v":"01"},{"$f":"RIGHT(\"0000000000000000\"&HEX2BIN(B8),16)","v":"0000000000000001"},{"$f":"IF(MID($C8,D$4,1)=\"1\",1,0)","v":0},0,0,0,0,0,0,0,0,0,0,0,0,0,0,1]
[null,null,"xor the 2 lines above",{"$f":"IF(D7=D8,0,1)","v":1},1,1,1,1,1,1,1,1,1,1,1,1,1,1,0,null,null,null,"xor means \"are they different?\""]
[null,null,"shift xor 1",{"$f":"IF($S9=1,IF(D$5=0,0,1),0)","v":0},{"$f":"IF($S9=1,IF(E$5=D9,0,1),D9)","v":1},1,1,1,1,1,1,1,1,1,1,1,1,1,1,null,null,null,null,"if the two input bits are different the result is 1 (true)."]
[null,null,"shift xor 2",1,0,0,1,1,1,1,1,1,1,1,1,1,1,1,0,null,null,null,null,"if the two input bits are the same the result is 0 (false)."]
[null,null,"shift xor 3",0,1,0,0,1,1,1,1,1,1,1,1,1,1,1,1]
[null,null,"shift xor 4",1,0,0,0,0,1,1,1,1,1,1,1,1,1,1,0,null,null,null,"shift xor:","shift all bits to the right one space. add a 0 at the far left."]
[null,null,"shift xor 5",0,1,0,0,0,0,1,1,1,1,1,1,1,1,1,1,null,null,null,null,"If bit16 was 1, xor the result with the xor constant."]
[null,null,"shift xor 6",1,0,0,0,0,0,0,1,1,1,1,1,1,1,1,0]
[null,null,"shift xor 7",0,1,0,0,0,0,0,0,1,1,1,1,1,1,1,1,null,null,null,null,null,null,null,{"$f":"IF(B8=\"\",\"\",TEXT(BIN2HEX(L17&M17&N17&O17&P17&Q17&R17&S17),\"00\"))","v":"7E"},{"$f":"IF(B8=\"\",\"\",TEXT(BIN2HEX(D17&E17&F17&G17&H17&I17&J17&K17),\"00\"))","v":"80"}]
[null,null,"shift xor 8",1,0,0,0,0,0,0,0,0,1,1,1,1,1,1,0,{"$f":"A8","v":1},null,null,{"$f":"IF(B8=\"\",\"\",AA17&AB17)","v":"7E80"},{"$f":"\"crc for a \"&A8&\" byte string\"","v":"crc for a 1 byte string"},null,null,{"$f":"IF(B8=\"\",\"\",IF(AA16=\"A\",\"0A\",IF(AA16=\"B\",\"0B\",IF(AA16=\"C\",\"0C\",IF(AA16=\"D\",\"0D\",IF(AA16=\"E\",\"0E\",IF(AA16=\"F\",\"0F\",AA16)))))))","v":"7E"},{"$f":"IF(B8=\"\",\"\",IF(AB16=\"A\",\"0A\",IF(AB16=\"B\",\"0B\",IF(AB16=\"C\",\"0C\",IF(AB16=\"D\",\"0D\",IF(AB16=\"E\",\"0E\",IF(AB16=\"F\",\"0F\",AB16)))))))","v":"80"}]
[{"$f":"A8+1","v":2},{"$f":"MID(C$2,A18*2-1,2)","v":"03"},{"$f":"RIGHT(\"0000000000000000\"&HEX2BIN(B18),16)","v":"0000000000000011"},{"$f":"IF(MID($C18,D$4,1)=\"1\",1,0)","v":0},0,0,0,0,0,0,0,0,0,0,0,0,0,1,1]
[null,null,"xor the 2 lines above",{"$f":"IF(D17=D18,0,1)","v":1},0,0,0,0,0,0,0,0,1,1,1,1,1,0,1]
[null,null,"shift xor 1",{"$f":"IF($S19=1,IF(D$5=0,0,1),0)","v":1},{"$f":"IF($S19=1,IF(E$5=D19,0,1),D19)","v":1},1,0,0,0,0,0,0,0,1,1,1,1,1,1]
[null,null,"shift xor 2",1,1,0,1,0,0,0,0,0,0,0,1,1,1,1,0]
[null,null,"shift xor 3",0,1,1,0,1,0,0,0,0,0,0,0,1,1,1,1]
[null,null,"shift xor 4",1,0,0,1,0,1,0,0,0,0,0,0,0,1,1,0]
[null,null,"shift xor 5",0,1,0,0,1,0,1,0,0,0,0,0,0,0,1,1]
[null,null,"shift xor 6",1,0,0,0,0,1,0,1,0,0,0,0,0,0,0,0]
[null,null,"shift xor 7",0,1,0,0,0,0,1,0,1,0,0,0,0,0,0,0,null,null,null,null,null,null,null,{"$f":"IF(B18=\"\",\"\",TEXT(BIN2HEX(L27&M27&N27&O27&P27&Q27&R27&S27),\"00\"))","v":"40"},{"$f":"IF(B18=\"\",\"\",TEXT(BIN2HEX(D27&E27&F27&G27&H27&I27&J27&K27),\"00\"))","v":"21"}]
[null,null,"shift xor 8",0,0,1,0,0,0,0,1,0,1,0,0,0,0,0,0,{"$f":"A18","v":2},null,null,{"$f":"IF(B18=\"\",\"\",AA27&AB27)","v":"4021"},{"$f":"\"crc for a \"&A18&\" byte string\"","v":"crc for a 2 byte string"},null,null,{"$f":"IF(B18=\"\",\"\",IF(AA26=\"A\",\"0A\",IF(AA26=\"B\",\"0B\",IF(AA26=\"C\",\"0C\",IF(AA26=\"D\",\"0D\",IF(AA26=\"E\",\"0E\",IF(AA26=\"F\",\"0F\",AA26)))))))","v":"40"},{"$f":"IF(B18=\"\",\"\",IF(AB26=\"A\",\"0A\",IF(AB26=\"B\",\"0B\",IF(AB26=\"C\",\"0C\",IF(AB26=\"D\",\"0D\",IF(AB26=\"E\",\"0E\",IF(AB26=\"F\",\"0F\",AB26)))))))","v":"21"}]
[{"$f":"A18+1","v":3},{"$f":"MID(C$2,A28*2-1,2)","v":"04"},{"$f":"RIGHT(\"0000000000000000\"&HEX2BIN(B28),16)","v":"0000000000000100"},{"$f":"IF(MID($C28,D$4,1)=\"1\",1,0)","v":0},0,0,0,0,0,0,0,0,0,0,0,0,1,0,0]
[null,null,"xor the 2 lines above",{"$f":"IF(D27=D28,0,1)","v":0},0,1,0,0,0,0,1,0,1,0,0,0,1,0,0]
[null,null,"shift xor 1",{"$f":"IF($S29=1,IF(D$5=0,0,1),0)","v":0},{"$f":"IF($S29=1,IF(E$5=D29,0,1),D29)","v":0},0,1,0,0,0,0,1,0,1,0,0,0,1,0]
[null,null,"shift xor 2",0,0,0,0,1,0,0,0,0,1,0,1,0,0,0,1]
[null,null,"shift xor 3",1,0,1,0,0,1,0,0,0,0,1,0,1,0,0,1]
[null,null,"shift xor 4",1,1,1,1,0,0,1,0,0,0,0,1,0,1,0,1]
[null,null,"shift xor 5",1,1,0,1,1,0,0,1,0,0,0,0,1,0,1,1]
[null,null,"shift xor 6",1,1,0,0,1,1,0,0,1,0,0,0,0,1,0,0]
[null,null,"shift xor 7",0,1,1,0,0,1,1,0,0,1,0,0,0,0,1,0,null,null,null,null,null,null,null,{"$f":"IF(B28=\"\",\"\",TEXT(BIN2HEX(L37&M37&N37&O37&P37&Q37&R37&S37),\"00\"))","v":"21"},{"$f":"IF(B28=\"\",\"\",TEXT(BIN2HEX(D37&E37&F37&G37&H37&I37&J37&K37),\"00\"))","v":"33"}]
[null,null,"shift xor 8",0,0,1,1,0,0,1,1,0,0,1,0,0,0,0,1,{"$f":"A28","v":3},null,null,{"$f":"IF(B28=\"\",\"\",AA37&AB37)","v":"2133"},{"$f":"\"crc for a \"&A28&\" byte string\"","v":"crc for a 3 byte string"},null,null,{"$f":"IF(B28=\"\",\"\",IF(AA36=\"A\",\"0A\",IF(AA36=\"B\",\"0B\",IF(AA36=\"C\",\"0C\",IF(AA36=\"D\",\"0D\",IF(AA36=\"E\",\"0E\",IF(AA36=\"F\",\"0F\",AA36)))))))","v":"21"},{"$f":"IF(B28=\"\",\"\",IF(AB36=\"A\",\"0A\",IF(AB36=\"B\",\"0B\",IF(AB36=\"C\",\"0C\",IF(AB36=\"D\",\"0D\",IF(AB36=\"E\",\"0E\",IF(AB36=\"F\",\"0F\",AB36)))))))","v":"33"}]
[{"$f":"A28+1","v":4},{"$f":"MID(C$2,A38*2-1,2)","v":"4C"},{"$f":"RIGHT(\"0000000000000000\"&HEX2BIN(B38),16)","v":"0000000001001100"},{"$f":"IF(MID($C38,D$4,1)=\"1\",1,0)","v":0},0,0,0,0,0,0,0,0,1,0,0,1,1,0,0]
[null,null,"xor the 2 lines above",{"$f":"IF(D37=D38,0,1)","v":0},0,1,1,0,0,1,1,0,1,1,0,1,1,0,1]
[null,null,"shift xor 1",{"$f":"IF($S39=1,IF(D$5=0,0,1),0)","v":1},{"$f":"IF($S39=1,IF(E$5=D39,0,1),D39)","v":0},1,1,1,0,0,1,1,0,1,1,0,1,1,1]
[null,null,"shift xor 2",1,1,1,1,1,1,0,0,1,1,0,1,1,0,1,0]
[null,null,"shift xor 3",0,1,1,1,1,1,1,0,0,1,1,0,1,1,0,1]
[null,null,"shift xor 4",1,0,0,1,1,1,1,1,0,0,1,1,0,1,1,1]
[null,null,"shift xor 5",1,1,1,0,1,1,1,1,1,0,0,1,1,0,1,0]
[null,null,"shift xor 6",0,1,1,1,0,1,1,1,1,1,0,0,1,1,0,1]
[null,null,"shift xor 7",1,0,0,1,1,0,1,1,1,1,1,0,0,1,1,1,null,null,null,null,null,null,null,{"$f":"IF(B38=\"\",\"\",TEXT(BIN2HEX(L47&M47&N47&O47&P47&Q47&R47&S47),\"00\"))","v":"F2"},{"$f":"IF(B38=\"\",\"\",TEXT(BIN2HEX(D47&E47&F47&G47&H47&I47&J47&K47),\"00\"))","v":"ED"}]
[null,null,"shift xor 8",1,1,1,0,1,1,0,1,1,1,1,1,0,0,1,0,{"$f":"A38","v":4},null,null,{"$f":"IF(B38=\"\",\"\",AA47&AB47)","v":"F2ED"},{"$f":"\"crc for a \"&A38&\" byte string\"","v":"crc for a 4 byte string"},null,null,{"$f":"IF(B38=\"\",\"\",IF(AA46=\"A\",\"0A\",IF(AA46=\"B\",\"0B\",IF(AA46=\"C\",\"0C\",IF(AA46=\"D\",\"0D\",IF(AA46=\"E\",\"0E\",IF(AA46=\"F\",\"0F\",AA46)))))))","v":"F2"},{"$f":"IF(B38=\"\",\"\",IF(AB46=\"A\",\"0A\",IF(AB46=\"B\",\"0B\",IF(AB46=\"C\",\"0C\",IF(AB46=\"D\",\"0D\",IF(AB46=\"E\",\"0E\",IF(AB46=\"F\",\"0F\",AB46)))))))","v":"ED"}]
[{"$f":"A38+1","v":5},{"$f":"MID(C$2,A48*2-1,2)","v":"00"},{"$f":"RIGHT(\"0000000000000000\"&HEX2BIN(B48),16)","v":"0000000000000000"},{"$f":"IF(MID($C48,D$4,1)=\"1\",1,0)","v":0},0,0,0,0,0,0,0,0,0,0,0,0,0,0,0]
[null,null,"xor the 2 lines above",{"$f":"IF(D47=D48,0,1)","v":1},1,1,0,1,1,0,1,1,1,1,1,0,0,1,0]
[null,null,"shift xor 1",{"$f":"IF($S49=1,IF(D$5=0,0,1),0)","v":0},{"$f":"IF($S49=1,IF(E$5=D49,0,1),D49)","v":1},1,1,0,1,1,0,1,1,1,1,1,0,0,1]
[null,null,"shift xor 2",1,0,0,1,1,0,1,1,0,1,1,1,1,1,0,1]
[null,null,"shift xor 3",1,1,1,0,1,1,0,1,1,0,1,1,1,1,1,1]
[null,null,"shift xor 4",1,1,0,1,0,1,1,0,1,1,0,1,1,1,1,0]
[null,null,"shift xor 5",0,1,1,0,1,0,1,1,0,1,1,0,1,1,1,1]
[null,null,"shift xor 6",1,0,0,1,0,1,0,1,1,0,1,1,0,1,1,0]
[null,null,"shift xor 7",0,1,0,0,1,0,1,0,1,1,0,1,1,0,1,1,null,null,null,null,null,null,null,{"$f":"IF(B48=\"\",\"\",TEXT(BIN2HEX(L57&M57&N57&O57&P57&Q57&R57&S57),\"00\"))","v":"6C"},{"$f":"IF(B48=\"\",\"\",TEXT(BIN2HEX(D57&E57&F57&G57&H57&I57&J57&K57),\"00\"))","v":"85"}]
[null,null,"shift xor 8",1,0,0,0,0,1,0,1,0,1,1,0,1,1,0,0,{"$f":"A48","v":5},null,null,{"$f":"IF(B48=\"\",\"\",AA57&AB57)","v":"6C85"},{"$f":"\"crc for a \"&A48&\" byte string\"","v":"crc for a 5 byte string"},null,null,{"$f":"IF(B48=\"\",\"\",IF(AA56=\"A\",\"0A\",IF(AA56=\"B\",\"0B\",IF(AA56=\"C\",\"0C\",IF(AA56=\"D\",\"0D\",IF(AA56=\"E\",\"0E\",IF(AA56=\"F\",\"0F\",AA56)))))))","v":"6C"},{"$f":"IF(B48=\"\",\"\",IF(AB56=\"A\",\"0A\",IF(AB56=\"B\",\"0B\",IF(AB56=\"C\",\"0C\",IF(AB56=\"D\",\"0D\",IF(AB56=\"E\",\"0E\",IF(AB56=\"F\",\"0F\",AB56)))))))","v":"85"}]
[{"$f":"A48+1","v":6},{"$f":"MID(C$2,A58*2-1,2)","v":"01"},{"$f":"RIGHT(\"0000000000000000\"&HEX2BIN(B58),16)","v":"0000000000000001"},{"$f":"IF(MID($C58,D$4,1)=\"1\",1,0)","v":0},0,0,0,0,0,0,0,0,0,0,0,0,0,0,1]
[null,null,"xor the 2 lines above",{"$f":"IF(D57=D58,0,1)","v":1},0,0,0,0,1,0,1,0,1,1,0,1,1,0,1]
[null,null,"shift xor 1",{"$f":"IF($S59=1,IF(D$5=0,0,1),0)","v":1},{"$f":"IF($S59=1,IF(E$5=D59,0,1),D59)","v":1},1,0,0,0,1,0,1,0,1,1,0,1,1,1]
[null,null,"shift xor 2",1,1,0,1,0,0,0,1,0,1,0,1,1,0,1,0]
[null,null,"shift xor 3",0,1,1,0,1,0,0,0,1,0,1,0,1,1,0,1]
[null,null,"shift xor 4",1,0,0,1,0,1,0,0,0,1,0,1,0,1,1,1]
[null,null,"shift xor 5",1,1,1,0,1,0,1,0,0,0,1,0,1,0,1,0]
[null,null,"shift xor 6",0,1,1,1,0,1,0,1,0,0,0,1,0,1,0,1]
[null,null,"shift xor 7",1,0,0,1,1,0,1,0,1,0,0,0,1,0,1,1,null,null,null,null,null,null,null,{"$f":"IF(B58=\"\",\"\",TEXT(BIN2HEX(L67&M67&N67&O67&P67&Q67&R67&S67),\"00\"))","v":"44"},{"$f":"IF(B58=\"\",\"\",TEXT(BIN2HEX(D67&E67&F67&G67&H67&I67&J67&K67),\"00\"))","v":"ED"}]
[null,null,"shift xor 8",1,1,1,0,1,1,0,1,0,1,0,0,0,1,0,0,{"$f":"A58","v":6},null,null,{"$f":"IF(B58=\"\",\"\",AA67&AB67)","v":"44ED"},{"$f":"\"crc for a \"&A58&\" byte string\"","v":"crc for a 6 byte string"},null,null,{"$f":"IF(B58=\"\",\"\",IF(AA66=\"A\",\"0A\",IF(AA66=\"B\",\"0B\",IF(AA66=\"C\",\"0C\",IF(AA66=\"D\",\"0D\",IF(AA66=\"E\",\"0E\",IF(AA66=\"F\",\"0F\",AA66)))))))","v":"44"},{"$f":"IF(B58=\"\",\"\",IF(AB66=\"A\",\"0A\",IF(AB66=\"B\",\"0B\",IF(AB66=\"C\",\"0C\",IF(AB66=\"D\",\"0D\",IF(AB66=\"E\",\"0E\",IF(AB66=\"F\",\"0F\",AB66)))))))","v":"ED"}]
[{"$f":"A58+1","v":7},{"$f":"MID(C$2,A68*2-1,2)","v":""},{"$f":"RIGHT(\"0000000000000000\"&HEX2BIN(B68),16)","v":"0000000000000000"},{"$f":"IF(MID($C68,D$4,1)=\"1\",1,0)","v":0},0,0,0,0,0,0,0,0,0,0,0,0,0,0,0]
[null,null,"xor the 2 lines above",{"$f":"IF(D67=D68,0,1)","v":1},1,1,0,1,1,0,1,0,1,0,0,0,1,0,0]
[null,null,"shift xor 1",{"$f":"IF($S69=1,IF(D$5=0,0,1),0)","v":0},{"$f":"IF($S69=1,IF(E$5=D69,0,1),D69)","v":1},1,1,0,1,1,0,1,0,1,0,0,0,1,0]
[null,null,"shift xor 2",0,0,1,1,1,0,1,1,0,1,0,1,0,0,0,1]
[null,null,"shift xor 3",1,0,1,1,1,1,0,1,1,0,1,0,1,0,0,1]
[null,null,"shift xor 4",1,1,1,1,1,1,1,0,1,1,0,1,0,1,0,1]
[null,null,"shift xor 5",1,1,0,1,1,1,1,1,0,1,1,0,1,0,1,1]
[null,null,"shift xor 6",1,1,0,0,1,1,1,1,1,0,1,1,0,1,0,0]
[null,null,"shift xor 7",0,1,1,0,0,1,1,1,1,1,0,1,1,0,1,0,null,null,null,null,null,null,null,{"$f":"IF(B68=\"\",\"\",TEXT(BIN2HEX(L77&M77&N77&O77&P77&Q77&R77&S77),\"00\"))","v":""},{"$f":"IF(B68=\"\",\"\",TEXT(BIN2HEX(D77&E77&F77&G77&H77&I77&J77&K77),\"00\"))","v":""}]
[null,null,"shift xor 8",0,0,1,1,0,0,1,1,1,1,1,0,1,1,0,1,{"$f":"A68","v":7},null,null,{"$f":"IF(B68=\"\",\"\",AA77&AB77)","v":""},{"$f":"\"crc for a \"&A68&\" byte string\"","v":"crc for a 7 byte string"},null,null,{"$f":"IF(B68=\"\",\"\",IF(AA76=\"A\",\"0A\",IF(AA76=\"B\",\"0B\",IF(AA76=\"C\",\"0C\",IF(AA76=\"D\",\"0D\",IF(AA76=\"E\",\"0E\",IF(AA76=\"F\",\"0F\",AA76)))))))","v":""},{"$f":"IF(B68=\"\",\"\",IF(AB76=\"A\",\"0A\",IF(AB76=\"B\",\"0B\",IF(AB76=\"C\",\"0C\",IF(AB76=\"D\",\"0D\",IF(AB76=\"E\",\"0E\",IF(AB76=\"F\",\"0F\",AB76)))))))","v":""}]
[{"$f":"A68+1","v":8},{"$f":"MID(C$2,A78*2-1,2)","v":""},{"$f":"RIGHT(\"0000000000000000\"&HEX2BIN(B78),16)","v":"0000000000000000"},{"$f":"IF(MID($C78,D$4,1)=\"1\",1,0)","v":0},0,0,0,0,0,0,0,0,0,0,0,0,0,0,0]
[null,null,"xor the 2 lines above",{"$f":"IF(D77=D78,0,1)","v":0},0,1,1,0,0,1,1,1,1,1,0,1,1,0,1]
[null,null,"shift xor 1",{"$f":"IF($S79=1,IF(D$5=0,0,1),0)","v":1},{"$f":"IF($S79=1,IF(E$5=D79,0,1),D79)","v":0},1,1,1,0,0,1,1,1,1,1,0,1,1,1]
[null,null,"shift xor 2",1,1,1,1,1,1,0,0,1,1,1,1,1,0,1,0]
[null,null,"shift xor 3",0,1,1,1,1,1,1,0,0,1,1,1,1,1,0,1]
[null,null,"shift xor 4",1,0,0,1,1,1,1,1,0,0,1,1,1,1,1,1]
[null,null,"shift xor 5",1,1,1,0,1,1,1,1,1,0,0,1,1,1,1,0]
[null,null,"shift xor 6",0,1,1,1,0,1,1,1,1,1,0,0,1,1,1,1]
[null,null,"shift xor 7",1,0,0,1,1,0,1,1,1,1,1,0,0,1,1,0,null,null,null,null,null,null,null,{"$f":"IF(B78=\"\",\"\",TEXT(BIN2HEX(L87&M87&N87&O87&P87&Q87&R87&S87),\"00\"))","v":""},{"$f":"IF(B78=\"\",\"\",TEXT(BIN2HEX(D87&E87&F87&G87&H87&I87&J87&K87),\"00\"))","v":""}]
[null,null,"shift xor 8",0,1,0,0,1,1,0,1,1,1,1,1,0,0,1,1,{"$f":"A78","v":8},null,null,{"$f":"IF(B78=\"\",\"\",AA87&AB87)","v":""},{"$f":"\"crc for a \"&A78&\" byte string\"","v":"crc for a 8 byte string"},null,null,{"$f":"IF(B78=\"\",\"\",IF(AA86=\"A\",\"0A\",IF(AA86=\"B\",\"0B\",IF(AA86=\"C\",\"0C\",IF(AA86=\"D\",\"0D\",IF(AA86=\"E\",\"0E\",IF(AA86=\"F\",\"0F\",AA86)))))))","v":""},{"$f":"IF(B78=\"\",\"\",IF(AB86=\"A\",\"0A\",IF(AB86=\"B\",\"0B\",IF(AB86=\"C\",\"0C\",IF(AB86=\"D\",\"0D\",IF(AB86=\"E\",\"0E\",IF(AB86=\"F\",\"0F\",AB86)))))))","v":""}]
[{"$f":"A78+1","v":9},{"$f":"MID(C$2,A88*2-1,2)","v":""},{"$f":"RIGHT(\"0000000000000000\"&HEX2BIN(B88),16)","v":"0000000000000000"},{"$f":"IF(MID($C88,D$4,1)=\"1\",1,0)","v":0},0,0,0,0,0,0,0,0,0,0,0,0,0,0,0]
[null,null,"xor the 2 lines above",{"$f":"IF(D87=D88,0,1)","v":0},1,0,0,1,1,0,1,1,1,1,1,0,0,1,1]
[null,null,"shift xor 1",{"$f":"IF($S89=1,IF(D$5=0,0,1),0)","v":1},{"$f":"IF($S89=1,IF(E$5=D89,0,1),D89)","v":0},0,0,0,1,1,0,1,1,1,1,1,0,0,0]
[null,null,"shift xor 2",0,1,0,0,0,0,1,1,0,1,1,1,1,1,0,0]
[null,null,"shift xor 3",0,0,1,0,0,0,0,1,1,0,1,1,1,1,1,0]
[null,null,"shift xor 4",0,0,0,1,0,0,0,0,1,1,0,1,1,1,1,1]
[null,null,"shift xor 5",1,0,1,0,1,0,0,0,0,1,1,0,1,1,1,0]
[null,null,"shift xor 6",0,1,0,1,0,1,0,0,0,0,1,1,0,1,1,1]
[null,null,"shift xor 7",1,0,0,0,1,0,1,0,0,0,0,1,1,0,1,0,null,null,null,null,null,null,null,{"$f":"IF(B88=\"\",\"\",TEXT(BIN2HEX(L97&M97&N97&O97&P97&Q97&R97&S97),\"00\"))","v":""},{"$f":"IF(B88=\"\",\"\",TEXT(BIN2HEX(D97&E97&F97&G97&H97&I97&J97&K97),\"00\"))","v":""}]
[null,null,"shift xor 8",0,1,0,0,0,1,0,1,0,0,0,0,1,1,0,1,{"$f":"A88","v":9},null,null,{"$f":"IF(B88=\"\",\"\",AA97&AB97)","v":""},{"$f":"\"crc for a \"&A88&\" byte string\"","v":"crc for a 9 byte string"},null,null,{"$f":"IF(B88=\"\",\"\",IF(AA96=\"A\",\"0A\",IF(AA96=\"B\",\"0B\",IF(AA96=\"C\",\"0C\",IF(AA96=\"D\",\"0D\",IF(AA96=\"E\",\"0E\",IF(AA96=\"F\",\"0F\",AA96)))))))","v":""},{"$f":"IF(B88=\"\",\"\",IF(AB96=\"A\",\"0A\",IF(AB96=\"B\",\"0B\",IF(AB96=\"C\",\"0C\",IF(AB96=\"D\",\"0D\",IF(AB96=\"E\",\"0E\",IF(AB96=\"F\",\"0F\",AB96)))))))","v":""}]
[{"$f":"A88+1","v":10},{"$f":"MID(C$2,A98*2-1,2)","v":""},{"$f":"RIGHT(\"0000000000000000\"&HEX2BIN(B98),16)","v":"0000000000000000"},{"$f":"IF(MID($C98,D$4,1)=\"1\",1,0)","v":0},0,0,0,0,0,0,0,0,0,0,0,0,0,0,0]
[null,null,"xor the 2 lines above",{"$f":"IF(D97=D98,0,1)","v":0},1,0,0,0,1,0,1,0,0,0,0,1,1,0,1]
[null,null,"shift xor 1",{"$f":"IF($S99=1,IF(D$5=0,0,1),0)","v":1},{"$f":"IF($S99=1,IF(E$5=D99,0,1),D99)","v":0},0,0,0,0,1,0,1,0,0,0,0,1,1,1]
[null,null,"shift xor 2",1,1,1,0,0,0,0,1,0,1,0,0,0,0,1,0]
[null,null,"shift xor 3",0,1,1,1,0,0,0,0,1,0,1,0,0,0,0,1]
[null,null,"shift xor 4",1,0,0,1,1,0,0,0,0,1,0,1,0,0,0,1]
[null,null,"shift xor 5",1,1,1,0,1,1,0,0,0,0,1,0,1,0,0,1]
[null,null,"shift xor 6",1,1,0,1,0,1,1,0,0,0,0,1,0,1,0,1]
[null,null,"shift xor 7",1,1,0,0,1,0,1,1,0,0,0,0,1,0,1,1,null,null,null,null,null,null,null,{"$f":"IF(B98=\"\",\"\",TEXT(BIN2HEX(L107&M107&N107&O107&P107&Q107&R107&S107),\"00\"))","v":""},{"$f":"IF(B98=\"\",\"\",TEXT(BIN2HEX(D107&E107&F107&G107&H107&I107&J107&K107),\"00\"))","v":""}]
[null,null,"shift xor 8",1,1,0,0,0,1,0,1,1,0,0,0,0,1,0,0,{"$f":"A98","v":10},null,null,{"$f":"IF(B98=\"\",\"\",AA107&AB107)","v":""},{"$f":"\"crc for a \"&A98&\" byte string\"","v":"crc for a 10 byte string"},null,null,{"$f":"IF(B98=\"\",\"\",IF(AA106=\"A\",\"0A\",IF(AA106=\"B\",\"0B\",IF(AA106=\"C\",\"0C\",IF(AA106=\"D\",\"0D\",IF(AA106=\"E\",\"0E\",IF(AA106=\"F\",\"0F\",AA106)))))))","v":""},{"$f":"IF(B98=\"\",\"\",IF(AB106=\"A\",\"0A\",IF(AB106=\"B\",\"0B\",IF(AB106=\"C\",\"0C\",IF(AB106=\"D\",\"0D\",IF(AB106=\"E\",\"0E\",IF(AB106=\"F\",\"0F\",AB106)))))))","v":""}]
[{"$f":"A98+1","v":11},{"$f":"MID(C$2,A108*2-1,2)","v":""},{"$f":"RIGHT(\"0000000000000000\"&HEX2BIN(B108),16)","v":"0000000000000000"},{"$f":"IF(MID($C108,D$4,1)=\"1\",1,0)","v":0},0,0,0,0,0,0,0,0,0,0,0,0,0,0,0]
[null,null,"xor the 2 lines above",{"$f":"IF(D107=D108,0,1)","v":1},1,0,0,0,1,0,1,1,0,0,0,0,1,0,0]
[null,null,"shift xor 1",{"$f":"IF($S109=1,IF(D$5=0,0,1),0)","v":0},{"$f":"IF($S109=1,IF(E$5=D109,0,1),D109)","v":1},1,0,0,0,1,0,1,1,0,0,0,0,1,0]
[null,null,"shift xor 2",0,0,1,1,0,0,0,1,0,1,1,0,0,0,0,1]
[null,null,"shift xor 3",1,0,1,1,1,0,0,0,1,0,1,1,0,0,0,1]
[null,null,"shift xor 4",1,1,1,1,1,1,0,0,0,1,0,1,1,0,0,1]
[null,null,"shift xor 5",1,1,0,1,1,1,1,0,0,0,1,0,1,1,0,1]
[null,null,"shift xor 6",1,1,0,0,1,1,1,1,0,0,0,1,0,1,1,1]
[null,null,"shift xor 7",1,1,0,0,0,1,1,1,1,0,0,0,1,0,1,0,null,null,null,null,null,null,null,{"$f":"IF(B108=\"\",\"\",TEXT(BIN2HEX(L117&M117&N117&O117&P117&Q117&R117&S117),\"00\"))","v":""},{"$f":"IF(B108=\"\",\"\",TEXT(BIN2HEX(D117&E117&F117&G117&H117&I117&J117&K117),\"00\"))","v":""}]
[null,null,"shift xor 8",0,1,1,0,0,0,1,1,1,1,0,0,0,1,0,1,{"$f":"A108","v":11},null,null,{"$f":"IF(B108=\"\",\"\",AA117&AB117)","v":""},{"$f":"\"crc for a \"&A108&\" byte string\"","v":"crc for a 11 byte string"},null,null,{"$f":"IF(B108=\"\",\"\",IF(AA116=\"A\",\"0A\",IF(AA116=\"B\",\"0B\",IF(AA116=\"C\",\"0C\",IF(AA116=\"D\",\"0D\",IF(AA116=\"E\",\"0E\",IF(AA116=\"F\",\"0F\",AA116)))))))","v":""},{"$f":"IF(B108=\"\",\"\",IF(AB116=\"A\",\"0A\",IF(AB116=\"B\",\"0B\",IF(AB116=\"C\",\"0C\",IF(AB116=\"D\",\"0D\",IF(AB116=\"E\",\"0E\",IF(AB116=\"F\",\"0F\",AB116)))))))","v":""}]
[{"$f":"A108+1","v":12},{"$f":"MID(C$2,A118*2-1,2)","v":""},{"$f":"RIGHT(\"0000000000000000\"&HEX2BIN(B118),16)","v":"0000000000000000"},{"$f":"IF(MID($C118,D$4,1)=\"1\",1,0)","v":0},0,0,0,0,0,0,0,0,0,0,0,0,0,0,0]
[null,null,"xor the 2 lines above",{"$f":"IF(D117=D118,0,1)","v":0},1,1,0,0,0,1,1,1,1,0,0,0,1,0,1]
[null,null,"shift xor 1",{"$f":"IF($S119=1,IF(D$5=0,0,1),0)","v":1},{"$f":"IF($S119=1,IF(E$5=D119,0,1),D119)","v":0},0,1,0,0,0,1,1,1,1,0,0,0,1,1]
[null,null,"shift xor 2",1,1,1,0,1,0,0,0,1,1,1,1,0,0,0,0]
[null,null,"shift xor 3",0,1,1,1,0,1,0,0,0,1,1,1,1,0,0,0]
[null,null,"shift xor 4",0,0,1,1,1,0,1,0,0,0,1,1,1,1,0,0]
[null,null,"shift xor 5",0,0,0,1,1,1,0,1,0,0,0,1,1,1,1,0]
[null,null,"shift xor 6",0,0,0,0,1,1,1,0,1,0,0,0,1,1,1,1]
[null,null,"shift xor 7",1,0,1,0,0,1,1,1,0,1,0,0,0,1,1,0,null,null,null,null,null,null,null,{"$f":"IF(B118=\"\",\"\",TEXT(BIN2HEX(L127&M127&N127&O127&P127&Q127&R127&S127),\"00\"))","v":""},{"$f":"IF(B118=\"\",\"\",TEXT(BIN2HEX(D127&E127&F127&G127&H127&I127&J127&K127),\"00\"))","v":""}]
[null,null,"shift xor 8",0,1,0,1,0,0,1,1,1,0,1,0,0,0,1,1,{"$f":"A118","v":12},null,null,{"$f":"IF(B118=\"\",\"\",AA127&AB127)","v":""},{"$f":"\"crc for a \"&A118&\" byte string\"","v":"crc for a 12 byte string"},null,null,{"$f":"IF(B118=\"\",\"\",IF(AA126=\"A\",\"0A\",IF(AA126=\"B\",\"0B\",IF(AA126=\"C\",\"0C\",IF(AA126=\"D\",\"0D\",IF(AA126=\"E\",\"0E\",IF(AA126=\"F\",\"0F\",AA126)))))))","v":""},{"$f":"IF(B118=\"\",\"\",IF(AB126=\"A\",\"0A\",IF(AB126=\"B\",\"0B\",IF(AB126=\"C\",\"0C\",IF(AB126=\"D\",\"0D\",IF(AB126=\"E\",\"0E\",IF(AB126=\"F\",\"0F\",AB126)))))))","v":""}]
[{"$f":"A118+1","v":13},{"$f":"MID(C$2,A128*2-1,2)","v":""},{"$f":"RIGHT(\"0000000000000000\"&HEX2BIN(B128),16)","v":"0000000000000000"},{"$f":"IF(MID($C128,D$4,1)=\"1\",1,0)","v":0},0,0,0,0,0,0,0,0,0,0,0,0,0,0,0]
[null,null,"xor the 2 lines above",{"$f":"IF(D127=D128,0,1)","v":0},1,0,1,0,0,1,1,1,0,1,0,0,0,1,1]
[null,null,"shift xor 1",{"$f":"IF($S129=1,IF(D$5=0,0,1),0)","v":1},{"$f":"IF($S129=1,IF(E$5=D129,0,1),D129)","v":0},0,0,1,0,0,1,1,1,0,1,0,0,0,0]
[null,null,"shift xor 2",0,1,0,0,0,1,0,0,1,1,1,0,1,0,0,0]
[null,null,"shift xor 3",0,0,1,0,0,0,1,0,0,1,1,1,0,1,0,0]
[null,null,"shift xor 4",0,0,0,1,0,0,0,1,0,0,1,1,1,0,1,0]
[null,null,"shift xor 5",0,0,0,0,1,0,0,0,1,0,0,1,1,1,0,1]
[null,null,"shift xor 6",1,0,1,0,0,1,0,0,0,1,0,0,1,1,1,1]
[null,null,"shift xor 7",1,1,1,1,0,0,1,0,0,0,1,0,0,1,1,0,null,null,null,null,null,null,null,{"$f":"IF(B128=\"\",\"\",TEXT(BIN2HEX(L137&M137&N137&O137&P137&Q137&R137&S137),\"00\"))","v":""},{"$f":"IF(B128=\"\",\"\",TEXT(BIN2HEX(D137&E137&F137&G137&H137&I137&J137&K137),\"00\"))","v":""}]
[null,null,"shift xor 8",0,1,1,1,1,0,0,1,0,0,0,1,0,0,1,1,{"$f":"A128","v":13},null,null,{"$f":"IF(B128=\"\",\"\",AA137&AB137)","v":""},{"$f":"\"crc for a \"&A128&\" byte string\"","v":"crc for a 13 byte string"},null,null,{"$f":"IF(B128=\"\",\"\",IF(AA136=\"A\",\"0A\",IF(AA136=\"B\",\"0B\",IF(AA136=\"C\",\"0C\",IF(AA136=\"D\",\"0D\",IF(AA136=\"E\",\"0E\",IF(AA136=\"F\",\"0F\",AA136)))))))","v":""},{"$f":"IF(B128=\"\",\"\",IF(AB136=\"A\",\"0A\",IF(AB136=\"B\",\"0B\",IF(AB136=\"C\",\"0C\",IF(AB136=\"D\",\"0D\",IF(AB136=\"E\",\"0E\",IF(AB136=\"F\",\"0F\",AB136)))))))","v":""}]
[{"$f":"A128+1","v":14},{"$f":"MID(C$2,A138*2-1,2)","v":""},{"$f":"RIGHT(\"0000000000000000\"&HEX2BIN(B138),16)","v":"0000000000000000"},{"$f":"IF(MID($C138,D$4,1)=\"1\",1,0)","v":0},0,0,0,0,0,0,0,0,0,0,0,0,0,0,0]
[null,null,"xor the 2 lines above",{"$f":"IF(D137=D138,0,1)","v":0},1,1,1,1,0,0,1,0,0,0,1,0,0,1,1]
[null,null,"shift xor 1",{"$f":"IF($S139=1,IF(D$5=0,0,1),0)","v":1},{"$f":"IF($S139=1,IF(E$5=D139,0,1),D139)","v":0},0,1,1,1,0,0,1,0,0,0,1,0,0,0]
[null,null,"shift xor 2",0,1,0,0,1,1,1,0,0,1,0,0,0,1,0,0]
[null,null,"shift xor 3",0,0,1,0,0,1,1,1,0,0,1,0,0,0,1,0]
[null,null,"shift xor 4",0,0,0,1,0,0,1,1,1,0,0,1,0,0,0,1]
[null,null,"shift xor 5",1,0,1,0,1,0,0,1,1,1,0,0,1,0,0,1]
[null,null,"shift xor 6",1,1,1,1,0,1,0,0,1,1,1,0,0,1,0,1]
[null,null,"shift xor 7",1,1,0,1,1,0,1,0,0,1,1,1,0,0,1,1,null,null,null,null,null,null,null,{"$f":"IF(B138=\"\",\"\",TEXT(BIN2HEX(L147&M147&N147&O147&P147&Q147&R147&S147),\"00\"))","v":""},{"$f":"IF(B138=\"\",\"\",TEXT(BIN2HEX(D147&E147&F147&G147&H147&I147&J147&K147),\"00\"))","v":""}]
[null,null,"shift xor 8",1,1,0,0,1,1,0,1,0,0,1,1,1,0,0,0,{"$f":"A138","v":14},null,null,{"$f":"IF(B138=\"\",\"\",AA147&AB147)","v":""},{"$f":"\"crc for a \"&A138&\" byte string\"","v":"crc for a 14 byte string"},null,null,{"$f":"IF(B138=\"\",\"\",IF(AA146=\"A\",\"0A\",IF(AA146=\"B\",\"0B\",IF(AA146=\"C\",\"0C\",IF(AA146=\"D\",\"0D\",IF(AA146=\"E\",\"0E\",IF(AA146=\"F\",\"0F\",AA146)))))))","v":""},{"$f":"IF(B138=\"\",\"\",IF(AB146=\"A\",\"0A\",IF(AB146=\"B\",\"0B\",IF(AB146=\"C\",\"0C\",IF(AB146=\"D\",\"0D\",IF(AB146=\"E\",\"0E\",IF(AB146=\"F\",\"0F\",AB146)))))))","v":""}]
[{"$f":"A138+1","v":15},{"$f":"MID(C$2,A148*2-1,2)","v":""},{"$f":"RIGHT(\"0000000000000000\"&HEX2BIN(B148),16)","v":"0000000000000000"},{"$f":"IF(MID($C148,D$4,1)=\"1\",1,0)","v":0},0,0,0,0,0,0,0,0,0,0,0,0,0,0,0]
[null,null,"xor the 2 lines above",{"$f":"IF(D147=D148,0,1)","v":1},1,0,0,1,1,0,1,0,0,1,1,1,0,0,0]
[null,null,"shift xor 1",{"$f":"IF($S149=1,IF(D$5=0,0,1),0)","v":0},{"$f":"IF($S149=1,IF(E$5=D149,0,1),D149)","v":1},1,0,0,1,1,0,1,0,0,1,1,1,0,0]
[null,null,"shift xor 2",0,0,1,1,0,0,1,1,0,1,0,0,1,1,1,0]
[null,null,"shift xor 3",0,0,0,1,1,0,0,1,1,0,1,0,0,1,1,1]
[null,null,"shift xor 4",1,0,1,0,1,1,0,0,1,1,0,1,0,0,1,0]
[null,null,"shift xor 5",0,1,0,1,0,1,1,0,0,1,1,0,1,0,0,1]
[null,null,"shift xor 6",1,0,0,0,1,0,1,1,0,0,1,1,0,1,0,1]
[null,null,"shift xor 7",1,1,1,0,0,1,0,1,1,0,0,1,1,0,1,1,null,null,null,null,null,null,null,{"$f":"IF(B148=\"\",\"\",TEXT(BIN2HEX(L157&M157&N157&O157&P157&Q157&R157&S157),\"00\"))","v":""},{"$f":"IF(B148=\"\",\"\",TEXT(BIN2HEX(D157&E157&F157&G157&H157&I157&J157&K157),\"00\"))","v":""}]
[null,null,"shift xor 8",1,1,0,1,0,0,1,0,1,1,0,0,1,1,0,0,{"$f":"A148","v":15},null,null,{"$f":"IF(B148=\"\",\"\",AA157&AB157)","v":""},{"$f":"\"crc for a \"&A148&\" byte string\"","v":"crc for a 15 byte string"},null,null,{"$f":"IF(B148=\"\",\"\",IF(AA156=\"A\",\"0A\",IF(AA156=\"B\",\"0B\",IF(AA156=\"C\",\"0C\",IF(AA156=\"D\",\"0D\",IF(AA156=\"E\",\"0E\",IF(AA156=\"F\",\"0F\",AA156)))))))","v":""},{"$f":"IF(B148=\"\",\"\",IF(AB156=\"A\",\"0A\",IF(AB156=\"B\",\"0B\",IF(AB156=\"C\",\"0C\",IF(AB156=\"D\",\"0D\",IF(AB156=\"E\",\"0E\",IF(AB156=\"F\",\"0F\",AB156)))))))","v":""}]
[{"$f":"A148+1","v":16},{"$f":"MID(C$2,A158*2-1,2)","v":""},{"$f":"RIGHT(\"0000000000000000\"&HEX2BIN(B158),16)","v":"0000000000000000"},{"$f":"IF(MID($C158,D$4,1)=\"1\",1,0)","v":0},0,0,0,0,0,0,0,0,0,0,0,0,0,0,0]
[null,null,"xor the 2 lines above",{"$f":"IF(D157=D158,0,1)","v":1},1,0,1,0,0,1,0,1,1,0,0,1,1,0,0]
[null,null,"shift xor 1",{"$f":"IF($S159=1,IF(D$5=0,0,1),0)","v":0},{"$f":"IF($S159=1,IF(E$5=D159,0,1),D159)","v":1},1,0,1,0,0,1,0,1,1,0,0,1,1,0]
[null,null,"shift xor 2",0,0,1,1,0,1,0,0,1,0,1,1,0,0,1,1]
[null,null,"shift xor 3",1,0,1,1,1,0,1,0,0,1,0,1,1,0,0,0]
[null,null,"shift xor 4",0,1,0,1,1,1,0,1,0,0,1,0,1,1,0,0]
[null,null,"shift xor 5",0,0,1,0,1,1,1,0,1,0,0,1,0,1,1,0]
[null,null,"shift xor 6",0,0,0,1,0,1,1,1,0,1,0,0,1,0,1,1]
[null,null,"shift xor 7",1,0,1,0,1,0,1,1,1,0,1,0,0,1,0,0,null,null,null,null,null,null,null,{"$f":"IF(B158=\"\",\"\",TEXT(BIN2HEX(L167&M167&N167&O167&P167&Q167&R167&S167),\"00\"))","v":""},{"$f":"IF(B158=\"\",\"\",TEXT(BIN2HEX(D167&E167&F167&G167&H167&I167&J167&K167),\"00\"))","v":""}]
[null,null,"shift xor 8",0,1,0,1,0,1,0,1,1,1,0,1,0,0,1,0,{"$f":"A158","v":16},null,null,{"$f":"IF(B158=\"\",\"\",AA167&AB167)","v":""},{"$f":"\"crc for a \"&A158&\" byte string\"","v":"crc for a 16 byte string"},null,null,{"$f":"IF(B158=\"\",\"\",IF(AA166=\"A\",\"0A\",IF(AA166=\"B\",\"0B\",IF(AA166=\"C\",\"0C\",IF(AA166=\"D\",\"0D\",IF(AA166=\"E\",\"0E\",IF(AA166=\"F\",\"0F\",AA166)))))))","v":""},{"$f":"IF(B158=\"\",\"\",IF(AB166=\"A\",\"0A\",IF(AB166=\"B\",\"0B\",IF(AB166=\"C\",\"0C\",IF(AB166=\"D\",\"0D\",IF(AB166=\"E\",\"0E\",IF(AB166=\"F\",\"0F\",AB166)))))))","v":""}]
[null,null,null,null,null,null,null,null,null,null,null,null,null,null,null,null,null,null,null,17,null,null,"16 bytes max"]